{"text_format":"1","workbook":"xlsx","n_sheets":3,"sheets":["Yahoo!ファイナンス","集計","セクター別構成比"],"not_rendered":{"charts":2,"images":0,"macros":1,"external_links":0,"defined_names":0,"comments":0,"pivot_tables":0},"unopened":[{"sheet":"セクター別構成比","index":2,"reason":"not_a_worksheet"}],"bounds":{"document_bytes":16777216,"sheet_cells":100000,"rows_first":2000,"rows_last":500,"rows_between":2000,"halvings":0,"cell_chars":16384,"cell_head_chars":4096},"cells_cut":0,"cells_raw":0,"read":"whole","date_system":"1900"}

{"sheet":"Yahoo!ファイナンス","index":0,"n_rows":52,"n_cols":13,"rows_kept":52,"cut":false,"hidden":false,"merged":[]}
["削除","編集","コード・市場・名称","業種","保有数","購入価格","時価","損益","EPS","1株配当","配当利回り","PER","PBR"]
[null,null,1605,"鉱業",1,1360,1348,{"$f":"-12-0.88%","v":-12.008800000000001},252.47,60,4.4499999999999998E-2,5.34,0.5]
[null,null,"東証PRM"]
[null,null,"(株)ＩＮＰＥＸ"]
[null,null,2914,"食料品",1,2345.5,2371.5,{"$f":"26+1.11%","v":26.011099999999999},203.98,150,6.3299999999999995E-2,11.63,1.1399999999999999]
[null,null,"東証PRM"]
[null,null,"ＪＴ"]
[null,null,4452,"化学",1,5866,6015,{"$f":"149+2.54%","v":149.02539999999999},234.54,148,2.46E-2,25.65,2.78]
[null,null,"東証PRM"]
[null,null,"花王(株)"]
[null,null,4503,"医薬品",1,1889,1900,{"$f":"11+0.58%","v":11.005800000000001},113.97,60,3.1600000000000003E-2,16.670000000000002,2.25]
[null,null,"東証PRM"]
[null,null,"アステラス製薬(株)"]
[null,null,4578,"医薬品",1,4428,4468,{"$f":"40+0.9%","v":40.009},248.86,100,2.24E-2,17.95,1.0900000000000001]
[null,null,"東証PRM"]
[null,null,"大塚ホールディングス(株)"]
[null,null,5108,"ゴム製品",1,4823,4857,{"$f":"34+0.7%","v":34.006999999999998},356.95,170,3.5000000000000003E-2,13.61,1.1399999999999999]
[null,null,"東証PRM"]
[null,null,"(株)ブリヂストン"]
[null,null,6301,"機械",1,2663,2662.5,{"$f":"-0.5-0.02%","v":-0.50019999999999998},239.3,96,3.61E-2,11.13,1.03]
[null,null,"東証PRM"]
[null,null,"コマツ"]
[null,null,6326,"機械",1,1998,2001,{"$f":"3+0.15%","v":3.0015000000000001},154.35,0,0,12.96,1.25]
[null,null,"東証PRM"]
[null,null,"(株)クボタ"]
[null,null,8058,"卸売業",1,4119,4163,{"$f":"44+1.07%","v":44.0107},576.6,150,3.5999999999999997E-2,7.22,0.81]
[null,null,"東証PRM"]
[null,null,"三菱商事(株)"]
[null,null,8316,"銀行業",1,4210,4226,{"$f":"16+0.38%","v":16.003799999999998},532.5,220,5.21E-2,7.94,0.47]
[null,null,"東証PRM"]
{"$rows_left_out":23}
{"sheet":"集計","index":1,"n_rows":53,"n_cols":24,"rows_kept":53,"cut":false,"hidden":false,"merged":[[53,0,53,1],[54,0,54,1],[54,14,54,15]]}
["高配当株ポートフォリオ",null,null,"合計","2022-08-28",{"$f":"COUNT(F4:F53)","v":50},{"$f":"SUM(G4:G53)","v":58880.2},{"$f":"SUM(H4:H53)","v":59331.6},{"$f":"SUM(I4:I53)","v":0.99999999999999989},{"$f":"SUM(J4:J53)","v":451.49489999999997},{"$f":"J1/G1","v":7.6680259238249872E-3},{"$f":"M1/F1","v":40.86},{"$f":"SUM(M4:M53)","v":2043},{"$f":"SUM(N4:N53)","v":1},{"$f":"M1/G1","v":3.4697572358789543E-2},null,"セクター別配当金構成比"]
[]
[null,"コード","市場","名称","業種","保有株式数","取得価額","時価","時価構成比","損益","損益率","1株配当","受取配当金","配当金構成比","簿価利回り",null,null,"行ラベル","コード個数","時価合計","取得価額合計","受取配当金合計","時価","配当金"]
[1,{"$f":"INDEX('Yahoo!ファイナンス'!C:C, ROW()*3-10)","v":1605},{"$f":"INDEX('Yahoo!ファイナンス'!C:C, ROW()*3-9)","v":"東証PRM"},{"$f":"INDEX('Yahoo!ファイナンス'!C:C, ROW()*3-8)","v":"(株)ＩＮＰＥＸ"},{"$f":"INDEX('Yahoo!ファイナンス'!D:D, ROW()*3-10)","v":"鉱業"},{"$f":"INDEX('Yahoo!ファイナンス'!E:E, ROW()*3-10)","v":1},{"$f":"INDEX('Yahoo!ファイナンス'!F:F, ROW()*3-10)","v":1360},{"$f":"INDEX('Yahoo!ファイナンス'!G:G, ROW()*3-10)","v":1348},{"$f":"IF(H4=\"---\",0,H4/$H$1)","v":2.2719764847062947E-2},{"$f":"INDEX('Yahoo!ファイナンス'!H:H, ROW()*3-10)","v":-12.008800000000001},{"$f":"IF(OR(J4=\"---\",J4=0),\"---\",J4/H4)","v":-8.9086053412462916E-3},{"$f":"INDEX('Yahoo!ファイナンス'!J:J, ROW()*3-10)","v":60},{"$f":"IF(F4=\"---\",0,F4*L4)","v":60},{"$f":"IFERROR(M4/$M$1,\"\")","v":2.9368575624082231E-2},{"$f":"IF(AND(G4<>\"---\",G4>0),M4/(G4*F4),0)","v":4.4117647058823532E-2},null,1,"不動産業",{"$f":"COUNTIFS(E:E,R4,F:F,\"<>---\")","v":0},{"$f":"SUMIF(集計!E:E,R4,集計!H:H)","v":0},{"$f":"SUMIF(集計!E:E,R4,集計!G:G)","v":0},{"$f":"SUMIF(集計!E:E,R4,集計!M:M)","v":0},{"$f":"T4/$T$15","v":0},{"$f":"V4/$V$15","v":0}]
[2,{"$f":"INDEX('Yahoo!ファイナンス'!C:C, ROW()*3-10)","v":2914},{"$f":"INDEX('Yahoo!ファイナンス'!C:C, ROW()*3-9)","v":"東証PRM"},{"$f":"INDEX('Yahoo!ファイナンス'!C:C, ROW()*3-8)","v":"ＪＴ"},{"$f":"INDEX('Yahoo!ファイナンス'!D:D, ROW()*3-10)","v":"食料品"},{"$f":"INDEX('Yahoo!ファイナンス'!E:E, ROW()*3-10)","v":1},{"$f":"INDEX('Yahoo!ファイナンス'!F:F, ROW()*3-10)","v":2345.5},{"$f":"INDEX('Yahoo!ファイナンス'!G:G, ROW()*3-10)","v":2371.5},{"$f":"IF(H5=\"---\",0,H5/$H$1)","v":3.9970268794369275E-2},{"$f":"INDEX('Yahoo!ファイナンス'!H:H, ROW()*3-10)","v":26.011099999999999},{"$f":"IF(OR(J5=\"---\",J5=0),\"---\",J5/H5)","v":1.096820577693443E-2},{"$f":"INDEX('Yahoo!ファイナンス'!J:J, ROW()*3-10)","v":150},{"$f":"IF(F5=\"---\",0,F5*L5)","v":150},{"$f":"IFERROR(M5/$M$1,\"\")","v":7.3421439060205582E-2},{"$f":"IF(AND(G5<>\"---\",G5>0),M5/(G5*F5),0)","v":6.395224898742273E-2},null,2,"サービス業",{"$f":"COUNTIFS(E:E,R5,F:F,\"<>---\")","v":0},{"$f":"SUMIF(集計!E:E,R5,集計!H:H)","v":0},{"$f":"SUMIF(集計!E:E,R5,集計!G:G)","v":0},{"$f":"SUMIF(集計!E:E,R5,集計!M:M)","v":0},{"$f":"T5/$T$15","v":0},{"$f":"V5/$V$15","v":0}]
[3,{"$f":"INDEX('Yahoo!ファイナンス'!C:C, ROW()*3-10)","v":4452},{"$f":"INDEX('Yahoo!ファイナンス'!C:C, ROW()*3-9)","v":"東証PRM"},{"$f":"INDEX('Yahoo!ファイナンス'!C:C, ROW()*3-8)","v":"花王(株)"},{"$f":"INDEX('Yahoo!ファイナンス'!D:D, ROW()*3-10)","v":"化学"},{"$f":"INDEX('Yahoo!ファイナンス'!E:E, ROW()*3-10)","v":1},{"$f":"INDEX('Yahoo!ファイナンス'!F:F, ROW()*3-10)","v":5866},{"$f":"INDEX('Yahoo!ファイナンス'!G:G, ROW()*3-10)","v":6015},0.10137936613878608,{"$f":"INDEX('Yahoo!ファイナンス'!H:H, ROW()*3-10)","v":149.02539999999999},2.4775627597672482E-2,{"$f":"INDEX('Yahoo!ファイナンス'!J:J, ROW()*3-10)","v":148},148,7.2442486539402842E-2,2.5230139788612341E-2,null,3,"その他金融業",{"$f":"COUNTIFS(E:E,R6,F:F,\"<>---\")","v":1},{"$f":"SUMIF(集計!E:E,R6,集計!H:H)","v":1960},{"$f":"SUMIF(集計!E:E,R6,集計!G:G)","v":1957.5},{"$f":"SUMIF(集計!E:E,R6,集計!M:M)","v":52},{"$f":"T6/$T$15","v":3.3034672923029203E-2},{"$f":"V6/$V$15","v":2.5452765540871267E-2}]
[4,{"$f":"INDEX('Yahoo!ファイナンス'!C:C, ROW()*3-10)","v":4503},{"$f":"INDEX('Yahoo!ファイナンス'!C:C, ROW()*3-9)","v":"東証PRM"},{"$f":"INDEX('Yahoo!ファイナンス'!C:C, ROW()*3-8)","v":"アステラス製薬(株)"},{"$f":"INDEX('Yahoo!ファイナンス'!D:D, ROW()*3-10)","v":"医薬品"},{"$f":"INDEX('Yahoo!ファイナンス'!E:E, ROW()*3-10)","v":1},{"$f":"INDEX('Yahoo!ファイナンス'!F:F, ROW()*3-10)","v":1889},{"$f":"INDEX('Yahoo!ファイナンス'!G:G, ROW()*3-10)","v":1900},3.202340742538546E-2,{"$f":"INDEX('Yahoo!ファイナンス'!H:H, ROW()*3-10)","v":11.005800000000001},5.7925263157894737E-3,{"$f":"INDEX('Yahoo!ファイナンス'!J:J, ROW()*3-10)","v":60},60,2.9368575624082231E-2,3.1762837480148229E-2,null,4,"化学",{"$f":"COUNTIFS(E:E,R7,F:F,\"<>---\")","v":1},{"$f":"SUMIF(集計!E:E,R7,集計!H:H)","v":6015},{"$f":"SUMIF(集計!E:E,R7,集計!G:G)","v":5866},{"$f":"SUMIF(集計!E:E,R7,集計!M:M)","v":148},{"$f":"T7/$T$15","v":0.10137936613878605},{"$f":"V7/$V$15","v":7.2442486539402842E-2}]
[5,{"$f":"INDEX('Yahoo!ファイナンス'!C:C, ROW()*3-10)","v":4578},{"$f":"INDEX('Yahoo!ファイナンス'!C:C, ROW()*3-9)","v":"東証PRM"},{"$f":"INDEX('Yahoo!ファイナンス'!C:C, ROW()*3-8)","v":"大塚ホールディングス(株)"},{"$f":"INDEX('Yahoo!ファイナンス'!D:D, ROW()*3-10)","v":"医薬品"},{"$f":"INDEX('Yahoo!ファイナンス'!E:E, ROW()*3-10)","v":1},{"$f":"INDEX('Yahoo!ファイナンス'!F:F, ROW()*3-10)","v":4428},{"$f":"INDEX('Yahoo!ファイナンス'!G:G, ROW()*3-10)","v":4468},7.5305570724538015E-2,{"$f":"INDEX('Yahoo!ファイナンス'!H:H, ROW()*3-10)","v":40.009},8.9545658012533565E-3,{"$f":"INDEX('Yahoo!ファイナンス'!J:J, ROW()*3-10)","v":100},100,4.8947626040137054E-2,2.2583559168925023E-2,null,5,"食料品",{"$f":"COUNTIFS(E:E,R8,F:F,\"<>---\")","v":1},{"$f":"SUMIF(集計!E:E,R8,集計!H:H)","v":2371.5},{"$f":"SUMIF(集計!E:E,R8,集計!G:G)","v":2345.5},{"$f":"SUMIF(集計!E:E,R8,集計!M:M)","v":150},{"$f":"T8/$T$15","v":3.9970268794369268E-2},{"$f":"V8/$V$15","v":7.3421439060205582E-2}]
[6,{"$f":"INDEX('Yahoo!ファイナンス'!C:C, ROW()*3-10)","v":5108},{"$f":"INDEX('Yahoo!ファイナンス'!C:C, ROW()*3-9)","v":"東証PRM"},{"$f":"INDEX('Yahoo!ファイナンス'!C:C, ROW()*3-8)","v":"(株)ブリヂストン"},{"$f":"INDEX('Yahoo!ファイナンス'!D:D, ROW()*3-10)","v":"ゴム製品"},{"$f":"INDEX('Yahoo!ファイナンス'!E:E, ROW()*3-10)","v":1},{"$f":"INDEX('Yahoo!ファイナンス'!F:F, ROW()*3-10)","v":4823},{"$f":"INDEX('Yahoo!ファイナンス'!G:G, ROW()*3-10)","v":4857},8.1861942034261684E-2,{"$f":"INDEX('Yahoo!ファイナンス'!H:H, ROW()*3-10)","v":34.006999999999998},7.0016471072678601E-3,{"$f":"INDEX('Yahoo!ファイナンス'!J:J, ROW()*3-10)","v":170},170,8.321096426823299E-2,3.5247771096827703E-2,null,6,"医薬品",{"$f":"COUNTIFS(E:E,R9,F:F,\"<>---\")","v":2},{"$f":"SUMIF(集計!E:E,R9,集計!H:H)","v":6368},{"$f":"SUMIF(集計!E:E,R9,集計!G:G)","v":6317},{"$f":"SUMIF(集計!E:E,R9,集計!M:M)","v":160},{"$f":"T9/$T$15","v":0.10732897814992345},{"$f":"V9/$V$15","v":7.8316201664219279E-2}]
[7,{"$f":"INDEX('Yahoo!ファイナンス'!C:C, ROW()*3-10)","v":6301},{"$f":"INDEX('Yahoo!ファイナンス'!C:C, ROW()*3-9)","v":"東証PRM"},{"$f":"INDEX('Yahoo!ファイナンス'!C:C, ROW()*3-8)","v":"コマツ"},{"$f":"INDEX('Yahoo!ファイナンス'!D:D, ROW()*3-10)","v":"機械"},{"$f":"INDEX('Yahoo!ファイナンス'!E:E, ROW()*3-10)","v":1},{"$f":"INDEX('Yahoo!ファイナンス'!F:F, ROW()*3-10)","v":2663},{"$f":"INDEX('Yahoo!ファイナンス'!G:G, ROW()*3-10)","v":2662.5},4.4874906457941469E-2,{"$f":"INDEX('Yahoo!ファイナンス'!H:H, ROW()*3-10)","v":-0.50019999999999998},-1.8786854460093897E-4,{"$f":"INDEX('Yahoo!ファイナンス'!J:J, ROW()*3-10)","v":96},96,4.6989720998531569E-2,3.6049568156214795E-2,null,7,"銀行業",{"$f":"COUNTIFS(E:E,R10,F:F,\"<>---\")","v":2},{"$f":"SUMIF(集計!E:E,R10,集計!H:H)","v":4918.6000000000004},{"$f":"SUMIF(集計!E:E,R10,集計!G:G)","v":4897.2},{"$f":"SUMIF(集計!E:E,R10,集計!M:M)","v":252},{"$f":"T10/$T$15","v":8.2900174611842584E-2},{"$f":"V10/$V$15","v":0.12334801762114538}]
[8,{"$f":"INDEX('Yahoo!ファイナンス'!C:C, ROW()*3-10)","v":6326},{"$f":"INDEX('Yahoo!ファイナンス'!C:C, ROW()*3-9)","v":"東証PRM"},{"$f":"INDEX('Yahoo!ファイナンス'!C:C, ROW()*3-8)","v":"(株)クボタ"},{"$f":"INDEX('Yahoo!ファイナンス'!D:D, ROW()*3-10)","v":"機械"},{"$f":"INDEX('Yahoo!ファイナンス'!E:E, ROW()*3-10)","v":1},{"$f":"INDEX('Yahoo!ファイナンス'!F:F, ROW()*3-10)","v":1998},{"$f":"INDEX('Yahoo!ファイナンス'!G:G, ROW()*3-10)","v":2001},3.3725704346419111E-2,{"$f":"INDEX('Yahoo!ファイナンス'!H:H, ROW()*3-10)","v":3.0015000000000001},1.5E-3,{"$f":"INDEX('Yahoo!ファイナンス'!J:J, ROW()*3-10)","v":0},0,0,0,null,8,"情報・通信",{"$f":"COUNTIFS(E:E,R11,F:F,\"<>---\")","v":2},{"$f":"SUMIF(集計!E:E,R11,集計!H:H)","v":8127},{"$f":"SUMIF(集計!E:E,R11,集計!G:G)","v":8193},{"$f":"SUMIF(集計!E:E,R11,集計!M:M)","v":255},{"$f":"T11/$T$15","v":0.13697591165584611},{"$f":"V11/$V$15","v":0.12481644640234948}]
[9,{"$f":"INDEX('Yahoo!ファイナンス'!C:C, ROW()*3-10)","v":8058},{"$f":"INDEX('Yahoo!ファイナンス'!C:C, ROW()*3-9)","v":"東証PRM"},{"$f":"INDEX('Yahoo!ファイナンス'!C:C, ROW()*3-8)","v":"三菱商事(株)"},{"$f":"INDEX('Yahoo!ファイナンス'!D:D, ROW()*3-10)","v":"卸売業"},{"$f":"INDEX('Yahoo!ファイナンス'!E:E, ROW()*3-10)","v":1},{"$f":"INDEX('Yahoo!ファイナンス'!F:F, ROW()*3-10)","v":4119},{"$f":"INDEX('Yahoo!ファイナンス'!G:G, ROW()*3-10)","v":4163},7.0164971111515623E-2,{"$f":"INDEX('Yahoo!ファイナンス'!H:H, ROW()*3-10)","v":44.0107},1.0571871246697093E-2,{"$f":"INDEX('Yahoo!ファイナンス'!J:J, ROW()*3-10)","v":150},150,7.3421439060205582E-2,3.6416605972323379E-2,null,9,"保険業",{"$f":"COUNTIFS(E:E,R12,F:F,\"<>---\")","v":1},{"$f":"SUMIF(集計!E:E,R12,集計!H:H)","v":7796},{"$f":"SUMIF(集計!E:E,R12,集計!G:G)","v":7653},{"$f":"SUMIF(集計!E:E,R12,集計!M:M)","v":300},{"$f":"T12/$T$15","v":0.13139709699384475},{"$f":"V12/$V$15","v":0.14684287812041116}]
[10,{"$f":"INDEX('Yahoo!ファイナンス'!C:C, ROW()*3-10)","v":8316},{"$f":"INDEX('Yahoo!ファイナンス'!C:C, ROW()*3-9)","v":"東証PRM"},{"$f":"INDEX('Yahoo!ファイナンス'!C:C, ROW()*3-8)","v":"(株)三井住友フィナンシャルグループ"},{"$f":"INDEX('Yahoo!ファイナンス'!D:D, ROW()*3-10)","v":"銀行業"},{"$f":"INDEX('Yahoo!ファイナンス'!E:E, ROW()*3-10)","v":1},{"$f":"INDEX('Yahoo!ファイナンス'!F:F, ROW()*3-10)","v":4210},{"$f":"INDEX('Yahoo!ファイナンス'!G:G, ROW()*3-10)","v":4226},7.1226799884041556E-2,{"$f":"INDEX('Yahoo!ファイナンス'!H:H, ROW()*3-10)","v":16.003799999999998},3.7869853289162324E-3,{"$f":"INDEX('Yahoo!ファイナンス'!J:J, ROW()*3-10)","v":220},220,0.10768477728830152,5.2256532066508314E-2,null,10,"卸売業",{"$f":"COUNTIFS(E:E,R13,F:F,\"<>---\")","v":3},{"$f":"SUMIF(集計!E:E,R13,集計!H:H)","v":10907},{"$f":"SUMIF(集計!E:E,R13,集計!G:G)","v":10807},{"$f":"SUMIF(集計!E:E,R13,集計!M:M)","v":400},{"$f":"T13/$T$15","v":0.18383121304667324},{"$f":"V13/$V$15","v":0.19579050416054822}]
[11,{"$f":"INDEX('Yahoo!ファイナンス'!C:C, ROW()*3-10)","v":9432},{"$f":"INDEX('Yahoo!ファイナンス'!C:C, ROW()*3-9)","v":"東証PRM"},{"$f":"INDEX('Yahoo!ファイナンス'!C:C, ROW()*3-8)","v":"日本電信電話(株)"},{"$f":"INDEX('Yahoo!ファイナンス'!D:D, ROW()*3-10)","v":"情報・通信"},{"$f":"INDEX('Yahoo!ファイナンス'!E:E, ROW()*3-10)","v":1},{"$f":"INDEX('Yahoo!ファイナンス'!F:F, ROW()*3-10)","v":3888},{"$f":"INDEX('Yahoo!ファイナンス'!G:G, ROW()*3-10)","v":3876},6.5327751147786342E-2,{"$f":"INDEX('Yahoo!ファイナンス'!H:H, ROW()*3-10)","v":-12.0031},-3.0967750257997937E-3,{"$f":"INDEX('Yahoo!ファイナンス'!J:J, ROW()*3-10)","v":120},120,5.8737151248164463E-2,3.0864197530864196E-2,null,11,"その他",{"$f":"S15-SUM(S4:S13)","v":37},{"$f":"T15-SUM(T4:T13)","v":10868.500000000015},10844,326,0.18318231768568527,0.15956926089084678]
[12,{"$f":"INDEX('Yahoo!ファイナンス'!C:C, ROW()*3-10)","v":8001},{"$f":"INDEX('Yahoo!ファイナンス'!C:C, ROW()*3-9)","v":"東証PRM"},{"$f":"INDEX('Yahoo!ファイナンス'!C:C, ROW()*3-8)","v":"伊藤忠商事(株)"},{"$f":"INDEX('Yahoo!ファイナンス'!D:D, ROW()*3-10)","v":"卸売業"},{"$f":"INDEX('Yahoo!ファイナンス'!E:E, ROW()*3-10)","v":1},{"$f":"INDEX('Yahoo!ファイナンス'!F:F, ROW()*3-10)","v":3597},{"$f":"INDEX('Yahoo!ファイナンス'!G:G, ROW()*3-10)","v":3616},6.094560065799675E-2,{"$f":"INDEX('Yahoo!ファイナンス'!H:H, ROW()*3-10)","v":19.005299999999998},5.2558904867256633E-3,{"$f":"INDEX('Yahoo!ファイナンス'!J:J, ROW()*3-10)","v":130},130,6.3631913852178174E-2,3.6141228801779259E-2,null,null,"総計",{"$f":"COUNT(F:F)-1","v":50},{"$f":"SUM(H:H)-H1","v":59331.600000000013},{"$f":"SUM(G:G)-G1","v":58880.2},{"$f":"SUM(M:M)-M1","v":2043},1,1]
[13,{"$f":"INDEX('Yahoo!ファイナンス'!C:C, ROW()*3-10)","v":8031},{"$f":"INDEX('Yahoo!ファイナンス'!C:C, ROW()*3-9)","v":"東証PRM"},{"$f":"INDEX('Yahoo!ファイナンス'!C:C, ROW()*3-8)","v":"三井物産(株)"},{"$f":"INDEX('Yahoo!ファイナンス'!D:D, ROW()*3-10)","v":"卸売業"},{"$f":"INDEX('Yahoo!ファイナンス'!E:E, ROW()*3-10)","v":1},{"$f":"INDEX('Yahoo!ファイナンス'!F:F, ROW()*3-10)","v":3091},{"$f":"INDEX('Yahoo!ファイナンス'!G:G, ROW()*3-10)","v":3128},5.2720641277160904E-2,{"$f":"INDEX('Yahoo!ファイナンス'!H:H, ROW()*3-10)","v":37.012},1.1832480818414322E-2,{"$f":"INDEX('Yahoo!ファイナンス'!J:J, ROW()*3-10)","v":120},120,5.8737151248164463E-2,3.8822387576835975E-2]
[14,{"$f":"INDEX('Yahoo!ファイナンス'!C:C, ROW()*3-10)","v":8306},{"$f":"INDEX('Yahoo!ファイナンス'!C:C, ROW()*3-9)","v":"東証PRM"},{"$f":"INDEX('Yahoo!ファイナンス'!C:C, ROW()*3-8)","v":"(株)三菱ＵＦＪフィナンシャル・グループ"},{"$f":"INDEX('Yahoo!ファイナンス'!D:D, ROW()*3-10)","v":"銀行業"},{"$f":"INDEX('Yahoo!ファイナンス'!E:E, ROW()*3-10)","v":1},{"$f":"INDEX('Yahoo!ファイナンス'!F:F, ROW()*3-10)","v":687.2},{"$f":"INDEX('Yahoo!ファイナンス'!G:G, ROW()*3-10)","v":692.6},1.1673374727801037E-2,{"$f":"INDEX('Yahoo!ファイナンス'!H:H, ROW()*3-10)","v":5.4079000000000006},7.8081143517181638E-3,{"$f":"INDEX('Yahoo!ファイナンス'!J:J, ROW()*3-10)","v":32},32,1.5663240332843859E-2,4.6565774155995339E-2]
[15,{"$f":"INDEX('Yahoo!ファイナンス'!C:C, ROW()*3-10)","v":8697},{"$f":"INDEX('Yahoo!ファイナンス'!C:C, ROW()*3-9)","v":"東証PRM"},{"$f":"INDEX('Yahoo!ファイナンス'!C:C, ROW()*3-8)","v":"(株)日本取引所グループ"},{"$f":"INDEX('Yahoo!ファイナンス'!D:D, ROW()*3-10)","v":"その他金融業"},{"$f":"INDEX('Yahoo!ファイナンス'!E:E, ROW()*3-10)","v":1},{"$f":"INDEX('Yahoo!ファイナンス'!F:F, ROW()*3-10)","v":1957.5},{"$f":"INDEX('Yahoo!ファイナンス'!G:G, ROW()*3-10)","v":1960},3.303467292302921E-2,{"$f":"INDEX('Yahoo!ファイナンス'!H:H, ROW()*3-10)","v":2.5013000000000001},1.2761734693877552E-3,{"$f":"INDEX('Yahoo!ファイナンス'!J:J, ROW()*3-10)","v":52},52,2.5452765540871267E-2,2.656449553001277E-2]
[16,{"$f":"INDEX('Yahoo!ファイナンス'!C:C, ROW()*3-10)","v":8766},{"$f":"INDEX('Yahoo!ファイナンス'!C:C, ROW()*3-9)","v":"東証PRM"},{"$f":"INDEX('Yahoo!ファイナンス'!C:C, ROW()*3-8)","v":"東京海上ホールディングス(株)"},{"$f":"INDEX('Yahoo!ファイナンス'!D:D, ROW()*3-10)","v":"保険業"},{"$f":"INDEX('Yahoo!ファイナンス'!E:E, ROW()*3-10)","v":1},{"$f":"INDEX('Yahoo!ファイナンス'!F:F, ROW()*3-10)","v":7653},{"$f":"INDEX('Yahoo!ファイナンス'!G:G, ROW()*3-10)","v":7796},0.13139709699384478,{"$f":"INDEX('Yahoo!ファイナンス'!H:H, ROW()*3-10)","v":143.0187},1.834513853258081E-2,{"$f":"INDEX('Yahoo!ファイナンス'!J:J, ROW()*3-10)","v":300},300,0.14684287812041116,3.9200313602508821E-2]
[17,{"$f":"INDEX('Yahoo!ファイナンス'!C:C, ROW()*3-10)","v":9433},{"$f":"INDEX('Yahoo!ファイナンス'!C:C, ROW()*3-9)","v":"東証PRM"},{"$f":"INDEX('Yahoo!ファイナンス'!C:C, ROW()*3-8)","v":"ＫＤＤＩ(株)"},{"$f":"INDEX('Yahoo!ファイナンス'!D:D, ROW()*3-10)","v":"情報・通信"},{"$f":"INDEX('Yahoo!ファイナンス'!E:E, ROW()*3-10)","v":1},{"$f":"INDEX('Yahoo!ファイナンス'!F:F, ROW()*3-10)","v":4305},{"$f":"INDEX('Yahoo!ファイナンス'!G:G, ROW()*3-10)","v":4251},7.1648160508059791E-2,{"$f":"INDEX('Yahoo!ファイナンス'!H:H, ROW()*3-10)","v":-54.012500000000003},-1.2705833921430253E-2,{"$f":"INDEX('Yahoo!ファイナンス'!J:J, ROW()*3-10)","v":135},135,6.6079295154185022E-2,3.1358885017421602E-2]
[18,{"$f":"INDEX('Yahoo!ファイナンス'!C:C, ROW()*3-10)","v":0},{"$f":"INDEX('Yahoo!ファイナンス'!C:C, ROW()*3-9)","v":0},{"$f":"INDEX('Yahoo!ファイナンス'!C:C, ROW()*3-8)","v":0},{"$f":"INDEX('Yahoo!ファイナンス'!D:D, ROW()*3-10)","v":0},{"$f":"INDEX('Yahoo!ファイナンス'!E:E, ROW()*3-10)","v":0},{"$f":"INDEX('Yahoo!ファイナンス'!F:F, ROW()*3-10)","v":0},{"$f":"INDEX('Yahoo!ファイナンス'!G:G, ROW()*3-10)","v":0},0,{"$f":"INDEX('Yahoo!ファイナンス'!H:H, ROW()*3-10)","v":0},"---",{"$f":"INDEX('Yahoo!ファイナンス'!J:J, ROW()*3-10)","v":0},0,0,0]
[19,{"$f":"INDEX('Yahoo!ファイナンス'!C:C, ROW()*3-10)","v":0},{"$f":"INDEX('Yahoo!ファイナンス'!C:C, ROW()*3-9)","v":0},{"$f":"INDEX('Yahoo!ファイナンス'!C:C, ROW()*3-8)","v":0},{"$f":"INDEX('Yahoo!ファイナンス'!D:D, ROW()*3-10)","v":0},{"$f":"INDEX('Yahoo!ファイナンス'!E:E, ROW()*3-10)","v":0},{"$f":"INDEX('Yahoo!ファイナンス'!F:F, ROW()*3-10)","v":0},{"$f":"INDEX('Yahoo!ファイナンス'!G:G, ROW()*3-10)","v":0},0,{"$f":"INDEX('Yahoo!ファイナンス'!H:H, ROW()*3-10)","v":0},"---",{"$f":"INDEX('Yahoo!ファイナンス'!J:J, ROW()*3-10)","v":0},0,0,0]
[20,{"$f":"INDEX('Yahoo!ファイナンス'!C:C, ROW()*3-10)","v":0},{"$f":"INDEX('Yahoo!ファイナンス'!C:C, ROW()*3-9)","v":0},{"$f":"INDEX('Yahoo!ファイナンス'!C:C, ROW()*3-8)","v":0},{"$f":"INDEX('Yahoo!ファイナンス'!D:D, ROW()*3-10)","v":0},{"$f":"INDEX('Yahoo!ファイナンス'!E:E, ROW()*3-10)","v":0},{"$f":"INDEX('Yahoo!ファイナンス'!F:F, ROW()*3-10)","v":0},{"$f":"INDEX('Yahoo!ファイナンス'!G:G, ROW()*3-10)","v":0},0,{"$f":"INDEX('Yahoo!ファイナンス'!H:H, ROW()*3-10)","v":0},"---",{"$f":"INDEX('Yahoo!ファイナンス'!J:J, ROW()*3-10)","v":0},0,0,0]
[21,{"$f":"INDEX('Yahoo!ファイナンス'!C:C, ROW()*3-10)","v":0},{"$f":"INDEX('Yahoo!ファイナンス'!C:C, ROW()*3-9)","v":0},{"$f":"INDEX('Yahoo!ファイナンス'!C:C, ROW()*3-8)","v":0},{"$f":"INDEX('Yahoo!ファイナンス'!D:D, ROW()*3-10)","v":0},{"$f":"INDEX('Yahoo!ファイナンス'!E:E, ROW()*3-10)","v":0},{"$f":"INDEX('Yahoo!ファイナンス'!F:F, ROW()*3-10)","v":0},{"$f":"INDEX('Yahoo!ファイナンス'!G:G, ROW()*3-10)","v":0},0,{"$f":"INDEX('Yahoo!ファイナンス'!H:H, ROW()*3-10)","v":0},"---",{"$f":"INDEX('Yahoo!ファイナンス'!J:J, ROW()*3-10)","v":0},0,0,0]
[22,{"$f":"INDEX('Yahoo!ファイナンス'!C:C, ROW()*3-10)","v":0},{"$f":"INDEX('Yahoo!ファイナンス'!C:C, ROW()*3-9)","v":0},{"$f":"INDEX('Yahoo!ファイナンス'!C:C, ROW()*3-8)","v":0},{"$f":"INDEX('Yahoo!ファイナンス'!D:D, ROW()*3-10)","v":0},{"$f":"INDEX('Yahoo!ファイナンス'!E:E, ROW()*3-10)","v":0},{"$f":"INDEX('Yahoo!ファイナンス'!F:F, ROW()*3-10)","v":0},{"$f":"INDEX('Yahoo!ファイナンス'!G:G, ROW()*3-10)","v":0},0,{"$f":"INDEX('Yahoo!ファイナンス'!H:H, ROW()*3-10)","v":0},"---",{"$f":"INDEX('Yahoo!ファイナンス'!J:J, ROW()*3-10)","v":0},0,0,0]
[23,{"$f":"INDEX('Yahoo!ファイナンス'!C:C, ROW()*3-10)","v":0},{"$f":"INDEX('Yahoo!ファイナンス'!C:C, ROW()*3-9)","v":0},{"$f":"INDEX('Yahoo!ファイナンス'!C:C, ROW()*3-8)","v":0},{"$f":"INDEX('Yahoo!ファイナンス'!D:D, ROW()*3-10)","v":0},{"$f":"INDEX('Yahoo!ファイナンス'!E:E, ROW()*3-10)","v":0},{"$f":"INDEX('Yahoo!ファイナンス'!F:F, ROW()*3-10)","v":0},{"$f":"INDEX('Yahoo!ファイナンス'!G:G, ROW()*3-10)","v":0},0,{"$f":"INDEX('Yahoo!ファイナンス'!H:H, ROW()*3-10)","v":0},"---",{"$f":"INDEX('Yahoo!ファイナンス'!J:J, ROW()*3-10)","v":0},0,0,0]
[24,{"$f":"INDEX('Yahoo!ファイナンス'!C:C, ROW()*3-10)","v":0},{"$f":"INDEX('Yahoo!ファイナンス'!C:C, ROW()*3-9)","v":0},{"$f":"INDEX('Yahoo!ファイナンス'!C:C, ROW()*3-8)","v":0},{"$f":"INDEX('Yahoo!ファイナンス'!D:D, ROW()*3-10)","v":0},{"$f":"INDEX('Yahoo!ファイナンス'!E:E, ROW()*3-10)","v":0},{"$f":"INDEX('Yahoo!ファイナンス'!F:F, ROW()*3-10)","v":0},{"$f":"INDEX('Yahoo!ファイナンス'!G:G, ROW()*3-10)","v":0},0,{"$f":"INDEX('Yahoo!ファイナンス'!H:H, ROW()*3-10)","v":0},"---",{"$f":"INDEX('Yahoo!ファイナンス'!J:J, ROW()*3-10)","v":0},0,0,0]
[25,{"$f":"INDEX('Yahoo!ファイナンス'!C:C, ROW()*3-10)","v":0},{"$f":"INDEX('Yahoo!ファイナンス'!C:C, ROW()*3-9)","v":0},{"$f":"INDEX('Yahoo!ファイナンス'!C:C, ROW()*3-8)","v":0},{"$f":"INDEX('Yahoo!ファイナンス'!D:D, ROW()*3-10)","v":0},{"$f":"INDEX('Yahoo!ファイナンス'!E:E, ROW()*3-10)","v":0},{"$f":"INDEX('Yahoo!ファイナンス'!F:F, ROW()*3-10)","v":0},{"$f":"INDEX('Yahoo!ファイナンス'!G:G, ROW()*3-10)","v":0},0,{"$f":"INDEX('Yahoo!ファイナンス'!H:H, ROW()*3-10)","v":0},"---",{"$f":"INDEX('Yahoo!ファイナンス'!J:J, ROW()*3-10)","v":0},0,0,0]
[26,{"$f":"INDEX('Yahoo!ファイナンス'!C:C, ROW()*3-10)","v":0},{"$f":"INDEX('Yahoo!ファイナンス'!C:C, ROW()*3-9)","v":0},{"$f":"INDEX('Yahoo!ファイナンス'!C:C, ROW()*3-8)","v":0},{"$f":"INDEX('Yahoo!ファイナンス'!D:D, ROW()*3-10)","v":0},{"$f":"INDEX('Yahoo!ファイナンス'!E:E, ROW()*3-10)","v":0},{"$f":"INDEX('Yahoo!ファイナンス'!F:F, ROW()*3-10)","v":0},{"$f":"INDEX('Yahoo!ファイナンス'!G:G, ROW()*3-10)","v":0},0,{"$f":"INDEX('Yahoo!ファイナンス'!H:H, ROW()*3-10)","v":0},"---",{"$f":"INDEX('Yahoo!ファイナンス'!J:J, ROW()*3-10)","v":0},0,0,0]
[27,{"$f":"INDEX('Yahoo!ファイナンス'!C:C, ROW()*3-10)","v":0},{"$f":"INDEX('Yahoo!ファイナンス'!C:C, ROW()*3-9)","v":0},{"$f":"INDEX('Yahoo!ファイナンス'!C:C, ROW()*3-8)","v":0},{"$f":"INDEX('Yahoo!ファイナンス'!D:D, ROW()*3-10)","v":0},{"$f":"INDEX('Yahoo!ファイナンス'!E:E, ROW()*3-10)","v":0},{"$f":"INDEX('Yahoo!ファイナンス'!F:F, ROW()*3-10)","v":0},{"$f":"INDEX('Yahoo!ファイナンス'!G:G, ROW()*3-10)","v":0},0,{"$f":"INDEX('Yahoo!ファイナンス'!H:H, ROW()*3-10)","v":0},"---",{"$f":"INDEX('Yahoo!ファイナンス'!J:J, ROW()*3-10)","v":0},0,0,0]
{"$rows_left_out":23}