{"text_format":"1","workbook":"xlsx","n_sheets":3,"sheets":["Chart1","LEAST SQUARE METHOD","RANDOM WAVE GENERATOR"],"not_rendered":{"charts":4,"images":0,"macros":1,"external_links":0,"defined_names":0,"comments":0,"pivot_tables":0},"unopened":[{"sheet":"Chart1","index":0,"reason":"not_a_worksheet"}],"bounds":{"document_bytes":16777216,"sheet_cells":100000,"rows_first":2000,"rows_last":500,"rows_between":2000,"halvings":0,"cell_chars":16384,"cell_head_chars":4096},"cells_cut":0,"cells_raw":0,"read":"whole","date_system":"1900"}

{"sheet":"LEAST SQUARE METHOD","index":1,"n_rows":25,"n_cols":14,"rows_kept":25,"cut":false,"hidden":false,"merged":[]}
["a0","a1","a2","a3","a4","a5","a6"]
[0.41760260384719583,0.3623582428821574,0.74781700554498076,-0.74674967005220316,0.19900948390869819,-2.0302304598063162E-2,6.8615025948400498E-4]
[]
["x0","x1","x2","x3","x4","x5","x6","y","y-LSM"]
[1,{"$f":"INDEX('RANDOM WAVE GENERATOR'!A:A, (ROW()-ROW(B$5))*50+2)","v":0},{"$f":"B5*$B5","v":0},{"$f":"C5*$B5","v":0},{"$f":"D5*$B5","v":0},{"$f":"E5*$B5","v":0},{"$f":"F5*$B5","v":0},0.69586623060326558,{"$f":"SUMPRODUCT($A$2:$G$2,A5:G5)","v":0.41760260384719583},0,0,0,0,0]
[1,{"$f":"INDEX('RANDOM WAVE GENERATOR'!A:A, (ROW()-ROW(B$5))*50+2)","v":0.31415926535897926},{"$f":"B6*$B6","v":9.8696044010893547E-2},{"$f":"C6*$B6","v":3.1006276680299802E-2},9.7409091034002353E-3,3.0601968478528112E-3,9.6138919357530324E-4,-5.5259912170601999E-2,0.58397052034100461]
[1,{"$f":"INDEX('RANDOM WAVE GENERATOR'!A:A, (ROW()-ROW(B$5))*50+2)","v":0.62831853071795962},0.39478417604357557,0.24805021344239972,0.15585454565440487,9.7926299131290834E-2,6.152890838882006E-2,0.72404794117700644,0.78434452914825314]
[1,{"$f":"INDEX('RANDOM WAVE GENERATOR'!A:A, (ROW()-ROW(B$5))*50+2)","v":0.9424777960769416},0.88826439609804908,0.83716947036810474,0.78901363737543184,0.74362783402824817,0.70085272211641303,1.7373762688532444,0.94062512529029862]
[1,{"$f":"INDEX('RANDOM WAVE GENERATOR'!A:A, (ROW()-ROW(B$5))*50+2)","v":1.2566370614359235},1.579136704174313,1.9844017075392177,2.4936727304705113,3.1336415722013591,3.9378501368845629,0.6469210346309241,1.0073556967969577]
[1,{"$f":"INDEX('RANDOM WAVE GENERATOR'!A:A, (ROW()-ROW(B$5))*50+2)","v":1.5707963267949054},2.4674011002723675,3.8757845850375432,6.0880681896252895,9.5631151495403142,15.021706149614639,1.4345088816582368,0.96545442228263956]
[1,{"$f":"INDEX('RANDOM WAVE GENERATOR'!A:A, (ROW()-ROW(B$5))*50+2)","v":1.8849555921538874},3.5530575843922123,6.6973557629448832,12.624218198007023,23.796090688904211,44.854574215451045,0.75001277423266344,{"$f":"SUMPRODUCT($A$2:$G$2,A11:G11)","v":0.81642112188261062}]
[1,{"$f":"INDEX('RANDOM WAVE GENERATOR'!A:A, (ROW()-ROW(B$5))*50+2)","v":2.1991148575128694},4.8361061565338481,10.635152901343044,23.38792275726459,51.432728421863914,113.10647723494537,-0.57248203386481322,0.57701906154940497]
[1,{"$f":"INDEX('RANDOM WAVE GENERATOR'!A:A, (ROW()-ROW(B$5))*50+2)","v":2.5132741228718514},6.316546816697274,15.875213660313825,39.898763687528465,100.27653031044437,252.0224087606147,0.68931869383136146,0.27443171070936784]
[1,{"$f":"INDEX('RANDOM WAVE GENERATOR'!A:A, (ROW()-ROW(B$5))*50+2)","v":2.8274333882308333},7.9943795648824905,22.603575699939036,63.91010462741076,180.70156366886707,510.92163442287449,9.9808532502472902E-2,{"$f":"SUMPRODUCT($A$2:$G$2,A14:G14)","v":-5.8105546720672474E-2}]
[1,{"$f":"INDEX('RANDOM WAVE GENERATOR'!A:A, (ROW()-ROW(B$5))*50+2)","v":3.1415926535898153},9.8696044010894965,31.00627668030047,97.409091034005158,306.01968478529216,961.38919357534485,2.2624589153599606E-2,-0.38519874795656073]
[1,{"$f":"INDEX('RANDOM WAVE GENERATOR'!A:A, (ROW()-ROW(B$5))*50+2)","v":3.4557519189487973},11.942221325318295,41.269354261479947,142.61665018288704,492.84776254356126,1703.1596011595329,-0.85754313511206881,-0.67271373360987075]
[1,{"$f":"INDEX('RANDOM WAVE GENERATOR'!A:A, (ROW()-ROW(B$5))*50+2)","v":3.7699111843077793},14.212230337568883,53.578846103559258,201.98749116811334,761.47490204493931,2870.6927497888873,-0.88753418537056272,-0.8907195765908047]
[1,{"$f":"INDEX('RANDOM WAVE GENERATOR'!A:A, (ROW()-ROW(B$5))*50+2)","v":4.084070449666755},16.679631437841209,68.120789866619887,278.21010490222079,1136.2296682298479,4640.4420120521827,-0.79842369455849249,-1.0159570576509407]
[1,{"$f":"INDEX('RANDOM WAVE GENERATOR'!A:A, (ROW()-ROW(B$5))*50+2)","v":4.3982297150257148},19.344424626135179,85.081223210742948,374.2067641162252,1645.8473094996,7238.8145430362647,-1.5078833439318369,-1.0338321875658947]
[1,{"$f":"INDEX('RANDOM WAVE GENERATOR'!A:A, (ROW()-ROW(B$5))*50+2)","v":4.7123889803846746},22.206609902450914,104.64618379601089,493.133523359631,2323.8369813381937,10950.82378306849,-0.60920795020720664,-0.93993477595780917]
[1,{"$f":"INDEX('RANDOM WAVE GENERATOR'!A:A, (ROW()-ROW(B$5))*50+2)","v":5.0265482457436343},25.266187266788407,127.00170928250542,638.38021900042065,3208.8489699340016,16129.434160678024,-1.1461833092515985,-0.74108204675753875]
[1,{"$f":"INDEX('RANDOM WAVE GENERATOR'!A:A, (ROW()-ROW(B$5))*50+2)","v":5.3407075111025941},28.523156719147664,152.33383733030837,813.57046922505867,4345.0419158015329,23205.59799577685,-0.23929068726577268,-0.45588730030716995]
[1,{"$f":"INDEX('RANDOM WAVE GENERATOR'!A:A, (ROW()-ROW(B$5))*50+2)","v":5.6548667764615539},31.977518259528686,180.82860559950146,1022.5616740384905,5782.4500374031695,32698.984603060053,5.7288280148960063E-2,-0.11485362210179773]
[1,{"$f":"INDEX('RANDOM WAVE GENERATOR'!A:A, (ROW()-ROW(B$5))*50+2)","v":5.9690260418205137},35.629271887931466,212.67205175016645,1269.4450152641434,7577.3503547709115,45229.401595625481,0.1033711180186023,0.2400073618284857]
[1,{"$f":"INDEX('RANDOM WAVE GENERATOR'!A:A, (ROW()-ROW(B$5))*50+2)","v":6.2831853071794734},39.478417604356011,248.05021344238514,1558.5454565439265,9792.629913128123,61528.908388812823,0.56764314891595513,0.5560316828965739]

{"sheet":"RANDOM WAVE GENERATOR","index":2,"n_rows":1002,"n_cols":14,"rows_kept":1002,"cut":false,"hidden":false,"merged":[]}
["x","y",null,null,1,2,3,4,5,6,7,8,9,10]
[0,{"$f":"SIN($A2+2*PI()*$F$2)+$E$2*SUM($E$4:$N$4*SIN($A2*$E$5:$N$5*$E$6:$N$6+2*PI()*$E$3:$N$3))","v":-0.26982547659487077},null,"a",{"$f":"0.3","v":0.3},{"$f":"RAND()","v":0.81183034416553224}]
[{"$f":"2*PI()/1000+A2","v":6.2831853071795866E-3},{"$f":"SIN($A3+2*PI()*$F$2)+$E$2*SUM($E$4:$N$4*SIN($A3*$E$5:$N$5*$E$6:$N$6+2*PI()*$E$3:$N$3))","v":-0.29469928352714703},null,"b",{"$f":"RAND()","v":6.5023687910235828E-2},{"$f":"RAND()","v":0.43149168405060234},0.36996845510228515,0.21285916796381654,2.4132154856989829E-2,0.1856561375286051,3.3250587901817563E-2,0.79585584911137663,0.74597753735986649,5.4851373064860542E-2]
[{"$f":"2*PI()/1000+A3","v":1.2566370614359173E-2},{"$f":"SIN($A4+2*PI()*$F$2)+$E$2*SUM($E$4:$N$4*SIN($A4*$E$5:$N$5*$E$6:$N$6+2*PI()*$E$3:$N$3))","v":-0.48210686342018294},null,"c",{"$f":"RAND()","v":0.65182465180004256},{"$f":"RAND()","v":0.77172399531120028},0.41443775511881475,0.89419294751823142,0.33772467710683862,0.39504864141147811,1.8832443603821303E-2,6.9434717649977107E-2,0.24521897418818861,0.96491520897556138]
[1.8849555921538759E-2,{"$f":"SIN($A5+2*PI()*$F$2)+$E$2*SUM($E$4:$N$4*SIN($A5*$E$5:$N$5*$E$6:$N$6+2*PI()*$E$3:$N$3))","v":-0.61913626760181195},null,"d",{"$f":"1/RAND()","v":2.3710140719708441},{"$f":"1/RAND()","v":1.0287104197064192},1.719856533541424,2.5892223857066035,12.963586245817009,1.0296799242603105,1.6374842319096352,1.0840662754499384,1.3452716902976125,3.6273089132422589]
[2.5132741228718346E-2,{"$f":"SIN($A6+2*PI()*$F$2)+$E$2*SUM($E$4:$N$4*SIN($A6*$E$5:$N$5*$E$6:$N$6+2*PI()*$E$3:$N$3))","v":-0.28259879308360336},null,"2^n",1,{"$f":"E6*2","v":2},{"$f":"F6*2","v":4},8,16,32,64,128,256,512]
[3.1415926535897934E-2,{"$f":"SIN($A7+2*PI()*$F$2)+$E$2*SUM($E$4:$N$4*SIN($A7*$E$5:$N$5*$E$6:$N$6+2*PI()*$E$3:$N$3))","v":-3.2484316089068432E-2}]
[3.7699111843077518E-2,{"$f":"SIN($A8+2*PI()*$F$2)+$E$2*SUM($E$4:$N$4*SIN($A8*$E$5:$N$5*$E$6:$N$6+2*PI()*$E$3:$N$3))","v":-7.6104466987655606E-2}]
[4.3982297150257102E-2,{"$f":"SIN($A9+2*PI()*$F$2)+$E$2*SUM($E$4:$N$4*SIN($A9*$E$5:$N$5*$E$6:$N$6+2*PI()*$E$3:$N$3))","v":-0.25672179033895659}]
[5.0265482457436686E-2,{"$f":"SIN($A10+2*PI()*$F$2)+$E$2*SUM($E$4:$N$4*SIN($A10*$E$5:$N$5*$E$6:$N$6+2*PI()*$E$3:$N$3))","v":-0.7137875316626523}]
[5.654866776461627E-2,{"$f":"SIN($A11+2*PI()*$F$2)+$E$2*SUM($E$4:$N$4*SIN($A11*$E$5:$N$5*$E$6:$N$6+2*PI()*$E$3:$N$3))","v":-0.91383223118847989}]
[6.2831853071795854E-2,{"$f":"SIN($A12+2*PI()*$F$2)+$E$2*SUM($E$4:$N$4*SIN($A12*$E$5:$N$5*$E$6:$N$6+2*PI()*$E$3:$N$3))","v":-0.62106907465773042}]
[6.9115038378975438E-2,{"$f":"SIN($A13+2*PI()*$F$2)+$E$2*SUM($E$4:$N$4*SIN($A13*$E$5:$N$5*$E$6:$N$6+2*PI()*$E$3:$N$3))","v":-0.48867911871155134}]
[7.5398223686155022E-2,{"$f":"SIN($A14+2*PI()*$F$2)+$E$2*SUM($E$4:$N$4*SIN($A14*$E$5:$N$5*$E$6:$N$6+2*PI()*$E$3:$N$3))","v":-0.48512396435242272}]
[8.1681408993334606E-2,{"$f":"SIN($A15+2*PI()*$F$2)+$E$2*SUM($E$4:$N$4*SIN($A15*$E$5:$N$5*$E$6:$N$6+2*PI()*$E$3:$N$3))","v":-0.49862169386695254}]
[8.796459430051419E-2,{"$f":"SIN($A16+2*PI()*$F$2)+$E$2*SUM($E$4:$N$4*SIN($A16*$E$5:$N$5*$E$6:$N$6+2*PI()*$E$3:$N$3))","v":-0.78809053814484142}]
[9.4247779607693774E-2,{"$f":"SIN($A17+2*PI()*$F$2)+$E$2*SUM($E$4:$N$4*SIN($A17*$E$5:$N$5*$E$6:$N$6+2*PI()*$E$3:$N$3))","v":-0.97350795830274461}]
[0.10053096491487336,{"$f":"SIN($A18+2*PI()*$F$2)+$E$2*SUM($E$4:$N$4*SIN($A18*$E$5:$N$5*$E$6:$N$6+2*PI()*$E$3:$N$3))","v":-1.0195542826575259}]
[0.10681415022205294,{"$f":"SIN($A19+2*PI()*$F$2)+$E$2*SUM($E$4:$N$4*SIN($A19*$E$5:$N$5*$E$6:$N$6+2*PI()*$E$3:$N$3))","v":-1.1960916129737904}]
[0.11309733552923253,{"$f":"SIN($A20+2*PI()*$F$2)+$E$2*SUM($E$4:$N$4*SIN($A20*$E$5:$N$5*$E$6:$N$6+2*PI()*$E$3:$N$3))","v":-1.0381814160772718}]
[0.11938052083641211,{"$f":"SIN($A21+2*PI()*$F$2)+$E$2*SUM($E$4:$N$4*SIN($A21*$E$5:$N$5*$E$6:$N$6+2*PI()*$E$3:$N$3))","v":-0.68122272942599349}]
[0.12566370614359171,{"$f":"SIN($A22+2*PI()*$F$2)+$E$2*SUM($E$4:$N$4*SIN($A22*$E$5:$N$5*$E$6:$N$6+2*PI()*$E$3:$N$3))","v":-0.69615812842994351}]
[0.13194689145077129,{"$f":"SIN($A23+2*PI()*$F$2)+$E$2*SUM($E$4:$N$4*SIN($A23*$E$5:$N$5*$E$6:$N$6+2*PI()*$E$3:$N$3))","v":-0.86635580107838139}]
[0.13823007675795088,{"$f":"SIN($A24+2*PI()*$F$2)+$E$2*SUM($E$4:$N$4*SIN($A24*$E$5:$N$5*$E$6:$N$6+2*PI()*$E$3:$N$3))","v":-1.1627477489169145}]
[0.14451326206513046,{"$f":"SIN($A25+2*PI()*$F$2)+$E$2*SUM($E$4:$N$4*SIN($A25*$E$5:$N$5*$E$6:$N$6+2*PI()*$E$3:$N$3))","v":-1.4571548218630559}]
[0.15079644737231004,{"$f":"SIN($A26+2*PI()*$F$2)+$E$2*SUM($E$4:$N$4*SIN($A26*$E$5:$N$5*$E$6:$N$6+2*PI()*$E$3:$N$3))","v":-1.1870028130957206}]
[0.15707963267948963,{"$f":"SIN($A27+2*PI()*$F$2)+$E$2*SUM($E$4:$N$4*SIN($A27*$E$5:$N$5*$E$6:$N$6+2*PI()*$E$3:$N$3))","v":-0.7836590413379908}]
[0.16336281798666921,{"$f":"SIN($A28+2*PI()*$F$2)+$E$2*SUM($E$4:$N$4*SIN($A28*$E$5:$N$5*$E$6:$N$6+2*PI()*$E$3:$N$3))","v":-0.73509345294413408}]
[0.1696460032938488,{"$f":"SIN($A29+2*PI()*$F$2)+$E$2*SUM($E$4:$N$4*SIN($A29*$E$5:$N$5*$E$6:$N$6+2*PI()*$E$3:$N$3))","v":-0.72821650965581552}]
[0.17592918860102838,{"$f":"SIN($A30+2*PI()*$F$2)+$E$2*SUM($E$4:$N$4*SIN($A30*$E$5:$N$5*$E$6:$N$6+2*PI()*$E$3:$N$3))","v":-0.87833434978946334}]
[0.18221237390820796,{"$f":"SIN($A31+2*PI()*$F$2)+$E$2*SUM($E$4:$N$4*SIN($A31*$E$5:$N$5*$E$6:$N$6+2*PI()*$E$3:$N$3))","v":-1.1058744258181052}]
[0.18849555921538755,{"$f":"SIN($A32+2*PI()*$F$2)+$E$2*SUM($E$4:$N$4*SIN($A32*$E$5:$N$5*$E$6:$N$6+2*PI()*$E$3:$N$3))","v":-1.0158373598094979}]
[0.19477874452256713,{"$f":"SIN($A33+2*PI()*$F$2)+$E$2*SUM($E$4:$N$4*SIN($A33*$E$5:$N$5*$E$6:$N$6+2*PI()*$E$3:$N$3))","v":-0.96505084283718634}]
[0.20106192982974672,{"$f":"SIN($A34+2*PI()*$F$2)+$E$2*SUM($E$4:$N$4*SIN($A34*$E$5:$N$5*$E$6:$N$6+2*PI()*$E$3:$N$3))","v":-0.92015570063246477}]
[0.2073451151369263,{"$f":"SIN($A35+2*PI()*$F$2)+$E$2*SUM($E$4:$N$4*SIN($A35*$E$5:$N$5*$E$6:$N$6+2*PI()*$E$3:$N$3))","v":-0.5595343035723277}]
[0.21362830044410588,{"$f":"SIN($A36+2*PI()*$F$2)+$E$2*SUM($E$4:$N$4*SIN($A36*$E$5:$N$5*$E$6:$N$6+2*PI()*$E$3:$N$3))","v":-0.4320102963094864}]
[0.21991148575128547,{"$f":"SIN($A37+2*PI()*$F$2)+$E$2*SUM($E$4:$N$4*SIN($A37*$E$5:$N$5*$E$6:$N$6+2*PI()*$E$3:$N$3))","v":-0.64347332781652111}]
[0.22619467105846505,{"$f":"SIN($A38+2*PI()*$F$2)+$E$2*SUM($E$4:$N$4*SIN($A38*$E$5:$N$5*$E$6:$N$6+2*PI()*$E$3:$N$3))","v":-0.84574307205960775}]
[0.23247785636564464,{"$f":"SIN($A39+2*PI()*$F$2)+$E$2*SUM($E$4:$N$4*SIN($A39*$E$5:$N$5*$E$6:$N$6+2*PI()*$E$3:$N$3))","v":-1.1096131413994874}]
[0.23876104167282422,{"$f":"SIN($A40+2*PI()*$F$2)+$E$2*SUM($E$4:$N$4*SIN($A40*$E$5:$N$5*$E$6:$N$6+2*PI()*$E$3:$N$3))","v":-1.0273185480422293}]
[0.2450442269800038,{"$f":"SIN($A41+2*PI()*$F$2)+$E$2*SUM($E$4:$N$4*SIN($A41*$E$5:$N$5*$E$6:$N$6+2*PI()*$E$3:$N$3))","v":-0.51447007480782503}]
[0.25132741228718342,{"$f":"SIN($A42+2*PI()*$F$2)+$E$2*SUM($E$4:$N$4*SIN($A42*$E$5:$N$5*$E$6:$N$6+2*PI()*$E$3:$N$3))","v":-0.34269712948436726}]
[0.257610597594363,{"$f":"SIN($A43+2*PI()*$F$2)+$E$2*SUM($E$4:$N$4*SIN($A43*$E$5:$N$5*$E$6:$N$6+2*PI()*$E$3:$N$3))","v":-0.47228432088189948}]
[0.26389378290154258,{"$f":"SIN($A44+2*PI()*$F$2)+$E$2*SUM($E$4:$N$4*SIN($A44*$E$5:$N$5*$E$6:$N$6+2*PI()*$E$3:$N$3))","v":-0.61518089413889365}]
[0.27017696820872217,{"$f":"SIN($A45+2*PI()*$F$2)+$E$2*SUM($E$4:$N$4*SIN($A45*$E$5:$N$5*$E$6:$N$6+2*PI()*$E$3:$N$3))","v":-0.8980660722609799}]
[0.27646015351590175,{"$f":"SIN($A46+2*PI()*$F$2)+$E$2*SUM($E$4:$N$4*SIN($A46*$E$5:$N$5*$E$6:$N$6+2*PI()*$E$3:$N$3))","v":-0.92311168036521374}]
[0.28274333882308134,{"$f":"SIN($A47+2*PI()*$F$2)+$E$2*SUM($E$4:$N$4*SIN($A47*$E$5:$N$5*$E$6:$N$6+2*PI()*$E$3:$N$3))","v":-0.70587332833754357}]
[0.28902652413026092,{"$f":"SIN($A48+2*PI()*$F$2)+$E$2*SUM($E$4:$N$4*SIN($A48*$E$5:$N$5*$E$6:$N$6+2*PI()*$E$3:$N$3))","v":-0.67722523176816496}]
[0.2953097094374405,{"$f":"SIN($A49+2*PI()*$F$2)+$E$2*SUM($E$4:$N$4*SIN($A49*$E$5:$N$5*$E$6:$N$6+2*PI()*$E$3:$N$3))","v":-0.49934684496054205}]
[0.30159289474462009,{"$f":"SIN($A50+2*PI()*$F$2)+$E$2*SUM($E$4:$N$4*SIN($A50*$E$5:$N$5*$E$6:$N$6+2*PI()*$E$3:$N$3))","v":-0.27327780446724992}]
[0.30787608005179967,{"$f":"SIN($A51+2*PI()*$F$2)+$E$2*SUM($E$4:$N$4*SIN($A51*$E$5:$N$5*$E$6:$N$6+2*PI()*$E$3:$N$3))","v":-0.46592820245902294}]
[0.31415926535897926,{"$f":"SIN($A52+2*PI()*$F$2)+$E$2*SUM($E$4:$N$4*SIN($A52*$E$5:$N$5*$E$6:$N$6+2*PI()*$E$3:$N$3))","v":-0.70744192360297109}]
[0.32044245066615884,{"$f":"SIN($A53+2*PI()*$F$2)+$E$2*SUM($E$4:$N$4*SIN($A53*$E$5:$N$5*$E$6:$N$6+2*PI()*$E$3:$N$3))","v":-0.86627862113115239}]
[0.32672563597333842,{"$f":"SIN($A54+2*PI()*$F$2)+$E$2*SUM($E$4:$N$4*SIN($A54*$E$5:$N$5*$E$6:$N$6+2*PI()*$E$3:$N$3))","v":-0.9245490257786555}]
[0.33300882128051801,{"$f":"SIN($A55+2*PI()*$F$2)+$E$2*SUM($E$4:$N$4*SIN($A55*$E$5:$N$5*$E$6:$N$6+2*PI()*$E$3:$N$3))","v":-0.50033192444262642}]
[0.33929200658769759,{"$f":"SIN($A56+2*PI()*$F$2)+$E$2*SUM($E$4:$N$4*SIN($A56*$E$5:$N$5*$E$6:$N$6+2*PI()*$E$3:$N$3))","v":-0.12274869614169237}]
[0.34557519189487718,{"$f":"SIN($A57+2*PI()*$F$2)+$E$2*SUM($E$4:$N$4*SIN($A57*$E$5:$N$5*$E$6:$N$6+2*PI()*$E$3:$N$3))","v":-0.28042127934960059}]
[0.35185837720205676,{"$f":"SIN($A58+2*PI()*$F$2)+$E$2*SUM($E$4:$N$4*SIN($A58*$E$5:$N$5*$E$6:$N$6+2*PI()*$E$3:$N$3))","v":-0.50268400614702502}]
[0.35814156250923634,{"$f":"SIN($A59+2*PI()*$F$2)+$E$2*SUM($E$4:$N$4*SIN($A59*$E$5:$N$5*$E$6:$N$6+2*PI()*$E$3:$N$3))","v":-0.7289454898309079}]
[0.36442474781641593,{"$f":"SIN($A60+2*PI()*$F$2)+$E$2*SUM($E$4:$N$4*SIN($A60*$E$5:$N$5*$E$6:$N$6+2*PI()*$E$3:$N$3))","v":-0.87249912897772008}]
[0.37070793312359551,{"$f":"SIN($A61+2*PI()*$F$2)+$E$2*SUM($E$4:$N$4*SIN($A61*$E$5:$N$5*$E$6:$N$6+2*PI()*$E$3:$N$3))","v":-0.61878241512697063}]
[0.3769911184307751,{"$f":"SIN($A62+2*PI()*$F$2)+$E$2*SUM($E$4:$N$4*SIN($A62*$E$5:$N$5*$E$6:$N$6+2*PI()*$E$3:$N$3))","v":-0.45321991514917204}]
[0.38327430373795468,{"$f":"SIN($A63+2*PI()*$F$2)+$E$2*SUM($E$4:$N$4*SIN($A63*$E$5:$N$5*$E$6:$N$6+2*PI()*$E$3:$N$3))","v":-0.4772129641041658}]
[0.38955748904513426,{"$f":"SIN($A64+2*PI()*$F$2)+$E$2*SUM($E$4:$N$4*SIN($A64*$E$5:$N$5*$E$6:$N$6+2*PI()*$E$3:$N$3))","v":-0.34126408508469075}]
[0.39584067435231385,{"$f":"SIN($A65+2*PI()*$F$2)+$E$2*SUM($E$4:$N$4*SIN($A65*$E$5:$N$5*$E$6:$N$6+2*PI()*$E$3:$N$3))","v":-0.45916618676549537}]
[0.40212385965949343,{"$f":"SIN($A66+2*PI()*$F$2)+$E$2*SUM($E$4:$N$4*SIN($A66*$E$5:$N$5*$E$6:$N$6+2*PI()*$E$3:$N$3))","v":-0.8149561631360801}]
[0.40840704496667302,{"$f":"SIN($A67+2*PI()*$F$2)+$E$2*SUM($E$4:$N$4*SIN($A67*$E$5:$N$5*$E$6:$N$6+2*PI()*$E$3:$N$3))","v":-0.96604177998362883}]
[{"$f":"2*PI()/1000+A67","v":0.4146902302738526},{"$f":"SIN($A68+2*PI()*$F$2)+$E$2*SUM($E$4:$N$4*SIN($A68*$E$5:$N$5*$E$6:$N$6+2*PI()*$E$3:$N$3))","v":-1.050926816878391}]
[0.42097341558103218,{"$f":"SIN($A69+2*PI()*$F$2)+$E$2*SUM($E$4:$N$4*SIN($A69*$E$5:$N$5*$E$6:$N$6+2*PI()*$E$3:$N$3))","v":-0.86429314418495251}]
[0.42725660088821177,{"$f":"SIN($A70+2*PI()*$F$2)+$E$2*SUM($E$4:$N$4*SIN($A70*$E$5:$N$5*$E$6:$N$6+2*PI()*$E$3:$N$3))","v":-0.42756139758638106}]
[0.43353978619539135,{"$f":"SIN($A71+2*PI()*$F$2)+$E$2*SUM($E$4:$N$4*SIN($A71*$E$5:$N$5*$E$6:$N$6+2*PI()*$E$3:$N$3))","v":-0.49278194650704044}]
[0.43982297150257094,{"$f":"SIN($A72+2*PI()*$F$2)+$E$2*SUM($E$4:$N$4*SIN($A72*$E$5:$N$5*$E$6:$N$6+2*PI()*$E$3:$N$3))","v":-0.89120407600592655}]
[0.44610615680975052,{"$f":"SIN($A73+2*PI()*$F$2)+$E$2*SUM($E$4:$N$4*SIN($A73*$E$5:$N$5*$E$6:$N$6+2*PI()*$E$3:$N$3))","v":-1.1409683625887062}]
[0.4523893421169301,{"$f":"SIN($A74+2*PI()*$F$2)+$E$2*SUM($E$4:$N$4*SIN($A74*$E$5:$N$5*$E$6:$N$6+2*PI()*$E$3:$N$3))","v":-1.330935636121505}]
[0.45867252742410969,{"$f":"SIN($A75+2*PI()*$F$2)+$E$2*SUM($E$4:$N$4*SIN($A75*$E$5:$N$5*$E$6:$N$6+2*PI()*$E$3:$N$3))","v":-1.1846085126783619}]
[0.46495571273128927,{"$f":"SIN($A76+2*PI()*$F$2)+$E$2*SUM($E$4:$N$4*SIN($A76*$E$5:$N$5*$E$6:$N$6+2*PI()*$E$3:$N$3))","v":-0.84244424583629196}]
[0.47123889803846886,{"$f":"SIN($A77+2*PI()*$F$2)+$E$2*SUM($E$4:$N$4*SIN($A77*$E$5:$N$5*$E$6:$N$6+2*PI()*$E$3:$N$3))","v":-0.84865239360323574}]
[0.47752208334564844,{"$f":"SIN($A78+2*PI()*$F$2)+$E$2*SUM($E$4:$N$4*SIN($A78*$E$5:$N$5*$E$6:$N$6+2*PI()*$E$3:$N$3))","v":-0.86349646050110951}]
[0.48380526865282802,{"$f":"SIN($A79+2*PI()*$F$2)+$E$2*SUM($E$4:$N$4*SIN($A79*$E$5:$N$5*$E$6:$N$6+2*PI()*$E$3:$N$3))","v":-0.83311187035725565}]
[0.49008845396000761,{"$f":"SIN($A80+2*PI()*$F$2)+$E$2*SUM($E$4:$N$4*SIN($A80*$E$5:$N$5*$E$6:$N$6+2*PI()*$E$3:$N$3))","v":-1.0981504241739848}]
[0.49637163926718719,{"$f":"SIN($A81+2*PI()*$F$2)+$E$2*SUM($E$4:$N$4*SIN($A81*$E$5:$N$5*$E$6:$N$6+2*PI()*$E$3:$N$3))","v":-1.2334844542196703}]
[0.50265482457436683,{"$f":"SIN($A82+2*PI()*$F$2)+$E$2*SUM($E$4:$N$4*SIN($A82*$E$5:$N$5*$E$6:$N$6+2*PI()*$E$3:$N$3))","v":-1.144394455979767}]
[0.50893800988154647,{"$f":"SIN($A83+2*PI()*$F$2)+$E$2*SUM($E$4:$N$4*SIN($A83*$E$5:$N$5*$E$6:$N$6+2*PI()*$E$3:$N$3))","v":-1.0002783135879494}]
[0.51522119518872611,{"$f":"SIN($A84+2*PI()*$F$2)+$E$2*SUM($E$4:$N$4*SIN($A84*$E$5:$N$5*$E$6:$N$6+2*PI()*$E$3:$N$3))","v":-0.55947217078646017}]
[0.52150438049590575,{"$f":"SIN($A85+2*PI()*$F$2)+$E$2*SUM($E$4:$N$4*SIN($A85*$E$5:$N$5*$E$6:$N$6+2*PI()*$E$3:$N$3))","v":-0.31535432268442026}]
[0.52778756580308539,{"$f":"SIN($A86+2*PI()*$F$2)+$E$2*SUM($E$4:$N$4*SIN($A86*$E$5:$N$5*$E$6:$N$6+2*PI()*$E$3:$N$3))","v":-0.6353527311270426}]
[0.53407075111026503,{"$f":"SIN($A87+2*PI()*$F$2)+$E$2*SUM($E$4:$N$4*SIN($A87*$E$5:$N$5*$E$6:$N$6+2*PI()*$E$3:$N$3))","v":-0.87713535480110782}]
[0.54035393641744467,{"$f":"SIN($A88+2*PI()*$F$2)+$E$2*SUM($E$4:$N$4*SIN($A88*$E$5:$N$5*$E$6:$N$6+2*PI()*$E$3:$N$3))","v":-0.90266595829054252}]
[0.54663712172462431,{"$f":"SIN($A89+2*PI()*$F$2)+$E$2*SUM($E$4:$N$4*SIN($A89*$E$5:$N$5*$E$6:$N$6+2*PI()*$E$3:$N$3))","v":-0.75869082518814546}]
[0.55292030703180395,{"$f":"SIN($A90+2*PI()*$F$2)+$E$2*SUM($E$4:$N$4*SIN($A90*$E$5:$N$5*$E$6:$N$6+2*PI()*$E$3:$N$3))","v":-0.29077094245076884}]
[0.55920349233898359,{"$f":"SIN($A91+2*PI()*$F$2)+$E$2*SUM($E$4:$N$4*SIN($A91*$E$5:$N$5*$E$6:$N$6+2*PI()*$E$3:$N$3))","v":-6.8242760025277627E-2}]
[0.56548667764616323,{"$f":"SIN($A92+2*PI()*$F$2)+$E$2*SUM($E$4:$N$4*SIN($A92*$E$5:$N$5*$E$6:$N$6+2*PI()*$E$3:$N$3))","v":-0.19857312268759192}]
[0.57176986295334287,{"$f":"SIN($A93+2*PI()*$F$2)+$E$2*SUM($E$4:$N$4*SIN($A93*$E$5:$N$5*$E$6:$N$6+2*PI()*$E$3:$N$3))","v":-0.18968885842070121}]
[0.57805304826052251,{"$f":"SIN($A94+2*PI()*$F$2)+$E$2*SUM($E$4:$N$4*SIN($A94*$E$5:$N$5*$E$6:$N$6+2*PI()*$E$3:$N$3))","v":-0.30113827734972143}]
[0.58433623356770215,{"$f":"SIN($A95+2*PI()*$F$2)+$E$2*SUM($E$4:$N$4*SIN($A95*$E$5:$N$5*$E$6:$N$6+2*PI()*$E$3:$N$3))","v":-0.49308906219816756}]
[0.59061941887488179,{"$f":"SIN($A96+2*PI()*$F$2)+$E$2*SUM($E$4:$N$4*SIN($A96*$E$5:$N$5*$E$6:$N$6+2*PI()*$E$3:$N$3))","v":-0.3719609862314105}]
[0.59690260418206142,{"$f":"SIN($A97+2*PI()*$F$2)+$E$2*SUM($E$4:$N$4*SIN($A97*$E$5:$N$5*$E$6:$N$6+2*PI()*$E$3:$N$3))","v":-0.22227061728916797}]
[0.60318578948924106,{"$f":"SIN($A98+2*PI()*$F$2)+$E$2*SUM($E$4:$N$4*SIN($A98*$E$5:$N$5*$E$6:$N$6+2*PI()*$E$3:$N$3))","v":-1.8413178318840151E-3}]
[0.6094689747964207,{"$f":"SIN($A99+2*PI()*$F$2)+$E$2*SUM($E$4:$N$4*SIN($A99*$E$5:$N$5*$E$6:$N$6+2*PI()*$E$3:$N$3))","v":0.29092439894772959}]
[0.61575216010360034,{"$f":"SIN($A100+2*PI()*$F$2)+$E$2*SUM($E$4:$N$4*SIN($A100*$E$5:$N$5*$E$6:$N$6+2*PI()*$E$3:$N$3))","v":4.6798101559781258E-2}]
[0.62203534541077998,{"$f":"SIN($A101+2*PI()*$F$2)+$E$2*SUM($E$4:$N$4*SIN($A101*$E$5:$N$5*$E$6:$N$6+2*PI()*$E$3:$N$3))","v":-0.41999550732891811}]
[0.62831853071795962,{"$f":"SIN($A102+2*PI()*$F$2)+$E$2*SUM($E$4:$N$4*SIN($A102*$E$5:$N$5*$E$6:$N$6+2*PI()*$E$3:$N$3))","v":-0.53460295734678676}]
[{"$f":"2*PI()/1000+A102","v":0.63460171602513926},{"$f":"SIN($A103+2*PI()*$F$2)+$E$2*SUM($E$4:$N$4*SIN($A103*$E$5:$N$5*$E$6:$N$6+2*PI()*$E$3:$N$3))","v":-0.48758772056500832}]
[0.6408849013323189,{"$f":"SIN($A104+2*PI()*$F$2)+$E$2*SUM($E$4:$N$4*SIN($A104*$E$5:$N$5*$E$6:$N$6+2*PI()*$E$3:$N$3))","v":-0.20313514233546287}]
[0.64716808663949854,{"$f":"SIN($A105+2*PI()*$F$2)+$E$2*SUM($E$4:$N$4*SIN($A105*$E$5:$N$5*$E$6:$N$6+2*PI()*$E$3:$N$3))","v":9.6769464877802913E-2}]
[0.65345127194667818,{"$f":"SIN($A106+2*PI()*$F$2)+$E$2*SUM($E$4:$N$4*SIN($A106*$E$5:$N$5*$E$6:$N$6+2*PI()*$E$3:$N$3))","v":-0.11209081068436594}]
[0.65973445725385782,{"$f":"SIN($A107+2*PI()*$F$2)+$E$2*SUM($E$4:$N$4*SIN($A107*$E$5:$N$5*$E$6:$N$6+2*PI()*$E$3:$N$3))","v":-0.37085037393617359}]
[0.66601764256103746,{"$f":"SIN($A108+2*PI()*$F$2)+$E$2*SUM($E$4:$N$4*SIN($A108*$E$5:$N$5*$E$6:$N$6+2*PI()*$E$3:$N$3))","v":-0.45164840123997957}]
[0.6723008278682171,{"$f":"SIN($A109+2*PI()*$F$2)+$E$2*SUM($E$4:$N$4*SIN($A109*$E$5:$N$5*$E$6:$N$6+2*PI()*$E$3:$N$3))","v":-0.66143548368816751}]
[0.67858401317539674,{"$f":"SIN($A110+2*PI()*$F$2)+$E$2*SUM($E$4:$N$4*SIN($A110*$E$5:$N$5*$E$6:$N$6+2*PI()*$E$3:$N$3))","v":-0.65990469467272095}]
[0.68486719848257638,{"$f":"SIN($A111+2*PI()*$F$2)+$E$2*SUM($E$4:$N$4*SIN($A111*$E$5:$N$5*$E$6:$N$6+2*PI()*$E$3:$N$3))","v":-0.46601933453570871}]
[0.69115038378975602,{"$f":"SIN($A112+2*PI()*$F$2)+$E$2*SUM($E$4:$N$4*SIN($A112*$E$5:$N$5*$E$6:$N$6+2*PI()*$E$3:$N$3))","v":-0.39216340313033043}]
[0.69743356909693566,{"$f":"SIN($A113+2*PI()*$F$2)+$E$2*SUM($E$4:$N$4*SIN($A113*$E$5:$N$5*$E$6:$N$6+2*PI()*$E$3:$N$3))","v":-0.20694767000777536}]
[0.7037167544041153,{"$f":"SIN($A114+2*PI()*$F$2)+$E$2*SUM($E$4:$N$4*SIN($A114*$E$5:$N$5*$E$6:$N$6+2*PI()*$E$3:$N$3))","v":-0.24281023615122493}]
[0.70999993971129494,{"$f":"SIN($A115+2*PI()*$F$2)+$E$2*SUM($E$4:$N$4*SIN($A115*$E$5:$N$5*$E$6:$N$6+2*PI()*$E$3:$N$3))","v":-0.72192684613752389}]
[0.71628312501847458,{"$f":"SIN($A116+2*PI()*$F$2)+$E$2*SUM($E$4:$N$4*SIN($A116*$E$5:$N$5*$E$6:$N$6+2*PI()*$E$3:$N$3))","v":-0.92815594793655576}]
[0.72256631032565422,{"$f":"SIN($A117+2*PI()*$F$2)+$E$2*SUM($E$4:$N$4*SIN($A117*$E$5:$N$5*$E$6:$N$6+2*PI()*$E$3:$N$3))","v":-0.78386360868534199}]
[0.72884949563283385,{"$f":"SIN($A118+2*PI()*$F$2)+$E$2*SUM($E$4:$N$4*SIN($A118*$E$5:$N$5*$E$6:$N$6+2*PI()*$E$3:$N$3))","v":-0.54411027454442007}]
[0.73513268094001349,{"$f":"SIN($A119+2*PI()*$F$2)+$E$2*SUM($E$4:$N$4*SIN($A119*$E$5:$N$5*$E$6:$N$6+2*PI()*$E$3:$N$3))","v":-0.17072028067413825}]
[0.74141586624719313,{"$f":"SIN($A120+2*PI()*$F$2)+$E$2*SUM($E$4:$N$4*SIN($A120*$E$5:$N$5*$E$6:$N$6+2*PI()*$E$3:$N$3))","v":-0.18090435509093017}]
{"$rows_left_out":882}