{"text_format":"1","workbook":"xlsx","n_sheets":7,"sheets":["Summary","Wing Geometry","Fuselage Geometry","LIFT","DRAG","VLM","FIGURE"],"not_rendered":{"charts":33,"images":0,"macros":1,"external_links":0,"defined_names":0,"comments":0,"pivot_tables":0},"unopened":[],"bounds":{"document_bytes":16777216,"sheet_cells":100000,"rows_first":2000,"rows_last":500,"rows_between":2000,"halvings":0,"cell_chars":16384,"cell_head_chars":4096},"cells_cut":0,"cells_raw":0,"read":"whole","date_system":"1900"}

{"sheet":"Summary","index":0,"n_rows":23,"n_cols":6,"rows_kept":23,"cut":false,"hidden":false,"merged":[]}
[]
[null,"速度","V",30,"m/s"]
[null,null,null,{"$f":"D2*3.6","v":108},"km/h"]
[null,null,null,{"$f":"D2*1.94384","v":58.315199999999997},"kt"]
[null,"代表面積","Sref",{"$f":"'Wing Geometry'!D3","v":24},"㎡"]
[null,"代表長さ(縦)","cMAC",{"$f":"'Wing Geometry'!D6","v":2.166666666666667},"m"]
[null,"代表長(横･方向)","bref",{"$f":"'Wing Geometry'!D4","v":12},"m"]
[null,"レイノルズ数","Re",{"$f":"(D2*D6)/D23","v":4449921.2706236737},"-"]
[null,"マッハ数","M",{"$f":"D2/D21","v":8.8160098739310577E-2},"-"]
[null,null,"β",{"$f":"SQRT(1-D9^2)","v":0.99610631811582995},"-"]
[null,null,"W",600,"kg"]
[null,null,"W/S",{"$f":"D11/D5","v":25},"kg/㎡"]
[null,null,"CL",{"$f":"(D11*9.81)/(0.5*D20*D2*D2*D5)","v":0.44489795918367347},"-"]
[null,null,"α",0,"deg","仮置き"]
[]
{"$rows_left_out":9}
{"sheet":"Wing Geometry","index":1,"n_rows":32,"n_cols":12,"rows_kept":32,"cut":false,"hidden":false,"merged":[]}
[]
[null,null,null,"Wing","Tail","Fin","unit","comment",null,"x","y","z"]
[null,"主翼面積","S",24,6,3,"㎡",null,null,{"$f":"D20+D24*D14*(1-COS(RADIANS(D23)))","v":2.0018269623051319},{"$f":"D21","v":0},{"$f":"D22+D24*D14*SIN(RADIANS(D23))","v":-0.19768264469190602}]
[null,"スパン","b",12,4,2,"m",null,null,{"$f":"D20+(D4/2)*TAN(RADIANS(D10))+D24*D15*(1-COS(RADIANS(D23+D25)))","v":5.4641016151377544},{"$f":"(D4/2)*COS(RADIANS(D26))","v":5.9771681885504737},{"$f":"L3+(D4/2)*SIN(RADIANS(D26))+D24*D15*SIN(RADIANS(D23+D25))","v":0.32525181179404306}]
[null,"平均幾何翼弦長","S/b",2,1.5,1.5,null,null,null,{"$f":"J4+D15*COS(RADIANS(D23+D25))","v":6.4641016151377544},{"$f":"K4","v":5.9771681885504737},{"$f":"L4-D15*SIN(RADIANS(D23+D25))","v":0.32525181179404306}]
[null,"平均空力翼弦長","cMAC",{"$f":"(2/3)*D14*(1+D13+D13^2)/(1+D13)","v":2.166666666666667},{"$f":"(2/3)*E14*(1+E13+E13^2)/(1+E13)","v":1.5555555555555554},{"$f":"(2/3)*F14*(1+F13+F13^2)/(1+F13)","v":1.5555555555555554},"m",null,null,{"$f":"J3+D14*COS(RADIANS(D23))","v":4.9945191130846043},{"$f":"K3","v":0},{"$f":"L3-D14*SIN(RADIANS(D23))","v":-0.4069520659242819}]
[null,"アスペクト比","A",{"$f":"D4*D4/D3","v":6},{"$f":"E4*E4/E3","v":2.6666666666666665},{"$f":"(2*F4)*(2*F4)/(2*F3)","v":2.6666666666666665},"-","垂直尾翼アスペクト比はフルスパンで計算",null,{"$f":"J3","v":2.0018269623051319},{"$f":"K3","v":0},{"$f":"L3","v":-0.19768264469190602}]
[null,"後退角","Λ",30,30,30,"deg"]
[null,"後退角定義位置","x/c_Λ",0,0,0,"-",null,null,{"$f":"E20+E24*E14*(1-COS(RADIANS(E23)))","v":7},{"$f":"E21","v":0},{"$f":"E22+E24*E14*SIN(RADIANS(E23))","v":0}]
[null,"前縁後退角","Λ_LE",{"$f":"DEGREES(ATAN(TAN(RADIANS(D8))-(4/D7)*((0-D9)*(1-D13)/(1+D13))))","v":29.999999999999996},{"$f":"DEGREES(ATAN(TAN(RADIANS(E8))-(4/E7)*((0-E9)*(1-E13)/(1+E13))))","v":29.999999999999996},{"$f":"DEGREES(ATAN(TAN(RADIANS(F8))-(4/F7)*((0-F9)*(1-F13)/(1+F13))))","v":29.999999999999996},"deg",null,null,{"$f":"E20+(E4/2)*TAN(RADIANS(E10))+E24*E15*(1-COS(RADIANS(E23+E25)))","v":8.1547005383792524},{"$f":"(E4/2)*COS(RADIANS(E26))","v":2},{"$f":"L9+(E4/2)*SIN(RADIANS(E26))+E24*E15*SIN(RADIANS(E23+E25))","v":0}]
[null,"c/4後退角","Λ_c/4",{"$f":"DEGREES(ATAN(TAN(RADIANS(D8))-(4/D7)*((0.25-D9)*(1-D13)/(1+D13))))","v":26.290151926293273},{"$f":"DEGREES(ATAN(TAN(RADIANS(E8))-(4/E7)*((0.25-E9)*(1-E13)/(1+E13))))","v":24.339630558638699},{"$f":"DEGREES(ATAN(TAN(RADIANS(F8))-(4/F7)*((0.25-F9)*(1-F13)/(1+F13))))","v":24.339630558638699},"deg",null,null,{"$f":"J10+E15*COS(RADIANS(E23+E25))","v":9.1547005383792524},{"$f":"K10","v":2},{"$f":"L10-E15*SIN(RADIANS(E23+E25))","v":0}]
[null,"c/2後退角","Λ_c/2",{"$f":"DEGREES(ATAN(TAN(RADIANS(D8))-(4/D7)*((0.5-D9)*(1-D13)/(1+D13))))","v":22.327152093734117},{"$f":"DEGREES(ATAN(TAN(RADIANS(E8))-(4/E7)*((0.5-E9)*(1-E13)/(1+E13))))","v":18.125873158100283},{"$f":"DEGREES(ATAN(TAN(RADIANS(F8))-(4/F7)*((0.5-F9)*(1-F13)/(1+F13))))","v":18.125873158100283},"deg",null,null,{"$f":"J9+E14*COS(RADIANS(E23))","v":9},{"$f":"K9","v":0},{"$f":"L9-E14*SIN(RADIANS(E23))","v":0}]
[null,"テーパー比","λ",{"$f":"D15/D14","v":0.33333333333333331},{"$f":"E15/E14","v":0.5},{"$f":"F15/F14","v":0.5},"-",null,null,{"$f":"J9","v":7},{"$f":"K9","v":0},{"$f":"L9","v":0}]
[null,"翼根コード長","cr",3,2,2,"m"]
[null,"翼単コード長","ct",1,1,1,"m",null,null,{"$f":"F20","v":7},{"$f":"E21","v":0},{"$f":"F22","v":0}]
{"$rows_left_out":18}
{"sheet":"Fuselage Geometry","index":2,"n_rows":7,"n_cols":10,"rows_kept":7,"cut":false,"hidden":false,"merged":[]}
[]
[null,null,null,"Body","unit","comment",null,"x","y","z"]
[null,"胴体長さ","Lf",10,"m",null,null,{"$f":"D20+D24*D14*(1-COS(RADIANS(D23)))","v":0},{"$f":"D21","v":0},{"$f":"D22+D24*D14*SIN(RADIANS(D23))","v":0}]
[null,"Finess Ratio","Lf/Rmax",15,"-",null,null,{"$f":"D20+(D4/2)*TAN(RADIANS(D10))+D24*D15*(1-COS(RADIANS(D23+D25)))","v":0},{"$f":"(D4/2)*COS(RADIANS(D26))","v":7.5},{"$f":"(D4/2)*SIN(RADIANS(D26))+D24*D15*SIN(RADIANS(D23+D25))","v":0}]
[null,"最大胴体直径","Dmax",{"$f":"(D3/D4)*2","v":1.3333333333333333},"m",null,null,{"$f":"H4+D15*COS(RADIANS(D23+D25))","v":0},{"$f":"I4","v":7.5},{"$f":"J4-D15*SIN(RADIANS(D23+D25))","v":0}]
[null,null,null,null,null,null,null,{"$f":"H3+D14*COS(RADIANS(D23))","v":0},{"$f":"I3","v":0},{"$f":"J3-D14*SIN(RADIANS(D23))","v":0}]
[null,null,null,null,null,null,null,{"$f":"H3","v":0},{"$f":"I3","v":0},{"$f":"J3","v":0}]

{"sheet":"LIFT","index":3,"n_rows":128,"n_cols":10,"rows_kept":128,"cut":false,"hidden":false,"merged":[]}
[null,null,null,null,"Wing","Tail","Fin"]
[]
[null,"4.1.1","design lift","NACA four digit",{"$f":"'Wing Geometry'!D28","v":"4412"},{"$f":"'Wing Geometry'!E28","v":"0010"},{"$f":"'Wing Geometry'!F28","v":"0010"},"-","input"]
[null,null,null,"cl_i",{"$f":"IF(MID(E3,2,1)<>\"0\",INDEX(FIGURE!$C$29:$C$34,MID(E3,2,1)-1)*(MID(E3,1,1)/6),0)","v":0.5066666666666666},{"$f":"IF(MID(F3,2,1)<>\"0\",INDEX(FIGURE!$C$29:$C$34,MID(F3,2,1)-1)*(MID(F3,2,1)/6),0)","v":0},{"$f":"IF(MID(G3,2,1)<>\"0\",INDEX(FIGURE!$C$29:$C$34,MID(G3,2,1)-1)*(MID(G3,2,1)/6),0)","v":0},"-","4.1.1"]
[null,null,null,"alpha_i",{"$f":"IF(MID(E3,2,1)<>\"0\",INDEX(FIGURE!$D$29:$D$34,MID(E3,2,1)-1)*(MID(E3,1,1)/6),0)","v":0.49333333333333329},{"$f":"IF(MID(F3,2,1)<>\"0\",INDEX(FIGURE!$D$29:$D$34,MID(F3,2,1)-1)*(MID(F3,1,1)/6),0)","v":0},{"$f":"IF(MID(G3,2,1)<>\"0\",INDEX(FIGURE!$D$29:$D$34,MID(G3,2,1)-1)*(MID(G3,1,1)/6),0)","v":0},"deg","4.1.1"]
[]
[null,"4.1.1.2","2次元揚力傾斜","NACA four digit",{"$f":"'Wing Geometry'!D$28","v":"4412"},{"$f":"'Wing Geometry'!E$28","v":"0010"},{"$f":"'Wing Geometry'!F$28","v":"0010"},"-","input"]
[null,null,null,"log10(Re)",{"$f":"LOG10(Summary!$D$8)","v":6.6483523273772986},{"$f":"LOG10(Summary!$D$8)","v":6.6483523273772986},{"$f":"LOG10(Summary!$D$8)","v":6.6483523273772986},"-","input"]
[null,null,null,"t/c",{"$f":"'Wing Geometry'!D$32","v":0.12},{"$f":"'Wing Geometry'!E$32","v":0.1},{"$f":"'Wing Geometry'!F$32","v":0.1},"-","input"]
[null,null,null,"β",{"$f":"Summary!$D$10","v":0.99610631811582995},{"$f":"Summary!$D$10","v":0.99610631811582995},{"$f":"Summary!$D$10","v":0.99610631811582995},"-","input"]
[null,null,null,"Y90/2",{"$f":"5*RIGHT(E7,2)*(0.2969*SQRT(0.9)-0.126*0.9-0.3516*(0.9^2)+0.2843*(0.9^3)-0.1015*(0.9^4))","v":1.4477172714718478},{"$f":"5*RIGHT(F7,2)*(0.2969*SQRT(0.9)-0.126*0.9-0.3516*(0.9^2)+0.2843*(0.9^3)-0.1015*(0.9^4))","v":1.2064310595598733},{"$f":"5*RIGHT(G7,2)*(0.2969*SQRT(0.9)-0.126*0.9-0.3516*(0.9^2)+0.2843*(0.9^3)-0.1015*(0.9^4))","v":1.2064310595598733},"%c","calculated"]
[null,null,null,"Y99/2",{"$f":"5*RIGHT(E7,2)*(0.2969*SQRT(0.99)-0.126*0.99-0.3516*(0.99^2)+0.2843*(0.99^3)-0.1015*(0.99^4))","v":0.26544724571732264},{"$f":"5*RIGHT(F7,2)*(0.2969*SQRT(0.99)-0.126*0.99-0.3516*(0.99^2)+0.2843*(0.99^3)-0.1015*(0.99^4))","v":0.22120603809776887},0.22120603809776887,"%c","calculated"]
[null,null,null,"tan((1/2)phi'_TE)",{"$f":"(E11-E12)/9","v":0.13136333619494722},{"$f":"(F11-F12)/9","v":0.10946944682912271},{"$f":"(G11-G12)/9","v":0.10946944682912271},"-","4.1.1.2-8a"]
[null,null,null,"cla/cla_theory",{"$f":"Interpolation2D(E13,E8,FIGURE!$B$40:$B$50,FIGURE!$C$38:$E$38,FIGURE!$C$40:$E$50)","v":0.81851526827252441},{"$f":"Interpolation2D(F13,F8,FIGURE!$B$40:$B$50,FIGURE!$C$38:$E$38,FIGURE!$C$40:$E$50)","v":0.83953320380431762},{"$f":"Interpolation2D(G13,G8,FIGURE!$B$40:$B$50,FIGURE!$C$38:$E$38,FIGURE!$C$40:$E$50)","v":0.83953320380431762},"-","4.1.1.2-8a"]
[null,null,null,"cla_theory",{"$f":"6.28+4.7*E9*(1+0.00375*20)","v":6.8863000000000003},{"$f":"6.28+4.7*F9*(1+0.00375*20)","v":6.7852500000000004},{"$f":"6.28+4.7*G9*(1+0.00375*20)","v":6.7852500000000004},"1/rad","4.1.1.2-8b"]
{"$rows_left_out":114}
{"sheet":"DRAG","index":4,"n_rows":20,"n_cols":9,"rows_kept":20,"cut":false,"hidden":false,"merged":[]}
[null,null,null,null,"Wing","Tail","Fin","unit","comment"]
[]
[null,"4.1.5.1","ゼロ揚力有害抗力係数","Sref",{"$f":"'Wing Geometry'!D$3","v":24},{"$f":"'Wing Geometry'!E$3","v":6},{"$f":"'Wing Geometry'!F$3","v":3},"m","input"]
[null,null,null,"Swet",{"$f":"LIFT!E58*2","v":48},{"$f":"LIFT!F58*2","v":12},{"$f":"LIFT!G58*2","v":6},"㎡","input"]
[null,null,null,"cMAC",{"$f":"'Wing Geometry'!D$6","v":2.166666666666667},{"$f":"'Wing Geometry'!E$6","v":1.5555555555555554},{"$f":"'Wing Geometry'!F$6","v":1.5555555555555554},"m","input"]
[null,null,null,"AR",{"$f":"'Wing Geometry'!D$7","v":6},{"$f":"'Wing Geometry'!E$7","v":2.6666666666666665},{"$f":"'Wing Geometry'!F$7","v":2.6666666666666665},"-","input"]
[null,null,null,"Λ_LE",{"$f":"'Wing Geometry'!D$10","v":29.999999999999996},{"$f":"'Wing Geometry'!E$10","v":29.999999999999996},{"$f":"'Wing Geometry'!F$10","v":29.999999999999996},"deg","input"]
[null,null,null,"λ",{"$f":"'Wing Geometry'!D$13","v":0.33333333333333331},{"$f":"'Wing Geometry'!E$13","v":0.5},{"$f":"'Wing Geometry'!F$13","v":0.5},"-","input"]
[null,null,null,"M",{"$f":"Summary!$D$9","v":8.8160098739310577E-2},{"$f":"Summary!$D$9","v":8.8160098739310577E-2},{"$f":"Summary!$D$9","v":8.8160098739310577E-2},"-","input"]
[null,null,null,"t/c",{"$f":"'Wing Geometry'!D$32","v":0.12},{"$f":"'Wing Geometry'!E$32","v":0.1},{"$f":"'Wing Geometry'!F$32","v":0.1},"-","input"]
[null,null,null,"x/c_(t/c)max",{"$f":"'Wing Geometry'!D$31","v":30},{"$f":"'Wing Geometry'!E$31","v":30},{"$f":"'Wing Geometry'!F$31","v":30},"%c","input"]
[null,null,null,"k",{"$f":"0.08*0.001","v":8.0000000000000007E-5},{"$f":"E12","v":8.0000000000000007E-5},{"$f":"E12","v":8.0000000000000007E-5},"ich","4.1.5.1-A"]
[null,null,null,"l/k",{"$f":"IF(E12<>0,(39.3701*E5)/E12,\"-\")","v":1066273.5416666667},{"$f":"IF(F12<>0,(39.3701*F5)/F12,\"-\")","v":765529.72222222202},{"$f":"IF(G12<>0,(39.3701*G5)/G12,\"-\")","v":765529.72222222202},"-","calculated"]
[null,null,null,"Re_cutoff",{"$f":"IF(E12<>0,Interpolation2D(E13,E9,FIGURE!$H$116:$H$123,FIGURE!$I$114:$L$114,FIGURE!$I$116:$L$123),\"-\")","v":83502841.756026968},{"$f":"IF(F12<>0,Interpolation2D(F13,F9,FIGURE!$H$116:$H$123,FIGURE!$I$114:$L$114,FIGURE!$I$116:$L$123),\"-\")","v":59936657.581798539},{"$f":"IF(G12<>0,Interpolation2D(G13,G9,FIGURE!$H$116:$H$123,FIGURE!$I$114:$L$114,FIGURE!$I$116:$L$123),\"-\")","v":59936657.581798539},"-","4.1.5.1-27"]
[null,null,null,"log10(Re_calclated)",{"$f":"IF(E12<>0,MIN(LOG10(E14),LOG10(Summary!$D$8)),LOG10(Summary!$D$8))","v":6.6483523273772986},{"$f":"IF(F12<>0,MIN(LOG10(F14),LOG10(Summary!$D$8)),LOG10(Summary!$D$8))","v":6.6483523273772986},{"$f":"IF(G12<>0,MIN(LOG10(G14),LOG10(Summary!$D$8)),LOG10(Summary!$D$8))","v":6.6483523273772986},"-","calculated"]
{"$rows_left_out":6}
{"sheet":"VLM","index":5,"n_rows":45,"n_cols":22,"rows_kept":45,"cut":false,"hidden":false,"merged":[]}
[]
[null,"cr",{"$f":"'Wing Geometry'!D14","v":3},"CL",0.53302812001534916,0.674824842165474,0.81662156431559962,0.95841828646572436,1.1002150086158493,1.2420117307659746,1.3838084529160992,1.5256051750662249,1.6674018972163489,1.8091986193664746,1.9509953415165981,null,null,null,"CL",{"$f":"Interpolation1D(T3,E3:O3,E2:O2)","v":1.4069539119349428}]
[null,"λ",{"$f":"'Wing Geometry'!D13","v":0.33333333333333331},"alpha",0,2,4,6,8,10,12,14,16,18,20,null,null,null,"alpha",12.326459718784452,{"$f":"MAX(U5:U33)","v":0},"←ゴールシーク(S3)"]
[null,"n","y","eta","cl","cl","cl","cl","cl","cl","cl","cl","cl","cl","cl",null,"Chord","Re_local","clmax","cl","Δ"]
[null,1,{"$f":"-('Wing Geometry'!$D$4/2)*COS(PI()/(COUNT($B:$B)-1)*(B5-1))","v":-6},{"$f":"C5/(Summary!$D$7/2)","v":-1},0,0,0,0,0,0,0,0,0,0,0,null,{"$f":"$C$2*(1+($C$3-1)*ABS(D5))","v":0.99999999999999978},{"$f":"Summary!$D$8*(Q5/Summary!$D$6)","v":2053809.8172109257},{"$f":"LIFT!$E$30-LIFT!$E$27+Interpolation2D(LIFT!$E$23,LOG10(R5),FIGURE!$AL$74:$AL$89,FIGURE!$AM$72:$AP$72,FIGURE!$AM$74:$AP$89)","v":1.6150562503728167},{"$f":"Interpolation2D(D5,$T$3,$D$5:$D$45,$E$3:$O$3,$E$5:$O$45)","v":0},{"$f":"T5-S5","v":-1.6150562503728167}]
[null,2,{"$f":"-('Wing Geometry'!$D$4/2)*COS(PI()/(COUNT($B:$B)-1)*(B6-1))","v":-5.9815040023987676},{"$f":"C6/(Summary!$D$7/2)","v":-0.99691733373312796},0.18037468665649875,0.23513884521104042,0.28990300376558298,0.34466716232012495,0.39943132087466748,0.45419547942920974,0.50895963798375188,0.56372379653829396,0.61848795509283605,0.67325211364737803,0.72801627220192011,null,{"$f":"$C$2*(1+($C$3-1)*ABS(D6))","v":1.0061653325337439},{"$f":"Summary!$D$8*(Q6/Summary!$D$6)","v":2066472.2376950989},{"$f":"LIFT!$E$30-LIFT!$E$27+Interpolation2D(LIFT!$E$23,LOG10(R6),FIGURE!$AL$74:$AL$89,FIGURE!$AM$72:$AP$72,FIGURE!$AM$74:$AP$89)","v":1.6150562503728167},{"$f":"Interpolation2D(D6,$T$3,$D$5:$D$45,$E$3:$O$3,$E$5:$O$45)","v":0.51789878388434341},{"$f":"T6-S6","v":-1.0971574664884733}]
[null,3,{"$f":"-('Wing Geometry'!$D$4/2)*COS(PI()/(COUNT($B:$B)-1)*(B7-1))","v":-5.9261300435708266},{"$f":"C7/(Summary!$D$7/2)","v":-0.98768834059513777},0.27119283931938409,0.35390417846986894,0.43661551762035461,0.51932685677083978,0.60203819592132612,0.68474953507181147,0.76746087422229714,0.85017221337278226,0.93288355252326693,1.0155948916737527,1.0983062308242375,null,1.0246233188097242,{"$f":"Summary!$D$8*(Q7/Summary!$D$6)","v":2104381.4311146522},{"$f":"LIFT!$E$30-LIFT!$E$27+Interpolation2D(LIFT!$E$23,LOG10(R7),FIGURE!$AL$74:$AL$89,FIGURE!$AM$72:$AP$72,FIGURE!$AM$74:$AP$89)","v":1.6150562503728167},{"$f":"Interpolation2D(D7,$T$3,$D$5:$D$45,$E$3:$O$3,$E$5:$O$45)","v":0.78096183448197354},-0.83409441589084321]
[null,4,{"$f":"-('Wing Geometry'!$D$4/2)*COS(PI()/(COUNT($B:$B)-1)*(B8-1))","v":-5.8342195223860589},{"$f":"C8/(Summary!$D$7/2)","v":-0.97236992039767645},0.35287114369016198,0.46110625555300411,0.56934136741584662,0.67757647927868858,0.78581159114153276,0.89404670300437539,1.0022818148672183,1.1105169267300605,1.2187520385929016,1.3269871504557451,1.4352222623185864,null,1.0552601592046469,{"$f":"Summary!$D$8*(Q8/Summary!$D$6)","v":2167303.6746860687},{"$f":"LIFT!$E$30-LIFT!$E$27+Interpolation2D(LIFT!$E$23,LOG10(R8),FIGURE!$AL$74:$AL$89,FIGURE!$AM$72:$AP$72,FIGURE!$AM$74:$AP$89)","v":1.6150562503728167},{"$f":"Interpolation2D(D8,$T$3,$D$5:$D$45,$E$3:$O$3,$E$5:$O$45)","v":1.019949016957892},-0.59510723341492477]
[null,5,{"$f":"-('Wing Geometry'!$D$4/2)*COS(PI()/(COUNT($B:$B)-1)*(B9-1))","v":-5.706339097770921},{"$f":"C9/(Summary!$D$7/2)","v":-0.95105651629515353},0.41972204595946999,0.54902779479014285,0.67833354362081721,0.80763929245149013,0.93694504128216449,1.0662507901128391,1.1955565389435123,1.324862287774186,1.4541680366048575,1.583473785435533,1.7127795342662051,null,1.0978869674096927,{"$f":"Summary!$D$8*(Q9/Summary!$D$6)","v":2254851.031853959},{"$f":"LIFT!$E$30-LIFT!$E$27+Interpolation2D(LIFT!$E$23,LOG10(R9),FIGURE!$AL$74:$AL$89,FIGURE!$AM$72:$AP$72,FIGURE!$AM$74:$AP$89)","v":1.6150562503728167},{"$f":"Interpolation2D(D9,$T$3,$D$5:$D$45,$E$3:$O$3,$E$5:$O$45)","v":1.2166630981437496},-0.39839315222906713]
[null,6,{"$f":"-('Wing Geometry'!$D$4/2)*COS(PI()/(COUNT($B:$B)-1)*(B10-1))","v":-5.54327719506772},{"$f":"C10/(Summary!$D$7/2)","v":-0.92387953251128663},0.47149119918827581,0.61690317913452952,0.76231515908078529,0.90772713902703828,1.0531391189732928,1.198551098919548,1.3439630788658017,1.4893750588120558,1.6347870387583083,1.7801990187045649,1.9256109986508183,null,1.1522409349774265,{"$f":"Summary!$D$8*(Q10/Summary!$D$6)","v":2366483.7440489349},{"$f":"LIFT!$E$30-LIFT!$E$27+Interpolation2D(LIFT!$E$23,LOG10(R10),FIGURE!$AL$74:$AL$89,FIGURE!$AM$72:$AP$72,FIGURE!$AM$74:$AP$89)","v":1.6150562503728167},{"$f":"Interpolation2D(D10,$T$3,$D$5:$D$45,$E$3:$O$3,$E$5:$O$45)","v":1.367698655906374},-0.24735759446644279]
[null,7,{"$f":"-('Wing Geometry'!$D$4/2)*COS(PI()/(COUNT($B:$B)-1)*(B11-1))","v":-5.3460391451302076},{"$f":"C11/(Summary!$D$7/2)","v":-0.8910065241883679},0.51006118552099144,0.66681378859677143,0.82356639167255286,0.98031899474833251,1.1370715978241128,1.2938242008998933,1.4505768039756741,1.6073294070514537,1.7640820101272332,1.9208346132030154,2.0775872162787952,null,1.217986951623264,{"$f":"Summary!$D$8*(Q11/Summary!$D$6)","v":2501513.5584786688},{"$f":"LIFT!$E$30-LIFT!$E$27+Interpolation2D(LIFT!$E$23,LOG10(R11),FIGURE!$AL$74:$AL$89,FIGURE!$AM$72:$AP$72,FIGURE!$AM$74:$AP$89)","v":1.6150562503728167},{"$f":"Interpolation2D(D11,$T$3,$D$5:$D$45,$E$3:$O$3,$E$5:$O$45)","v":1.4761635093350991},-0.13889274103771765]
[null,8,{"$f":"-('Wing Geometry'!$D$4/2)*COS(PI()/(COUNT($B:$B)-1)*(B12-1))","v":-5.1158409861245531},{"$f":"C12/(Summary!$D$7/2)","v":-0.85264016435409218},0.53815373358721663,0.70213181045071682,0.86610988731421878,1.0300879641777192,1.1940660410412196,1.3580441179047202,1.522022194768222,1.6860002716317222,1.849978348495221,2.0139564253587237,2.177934502222223,null,1.2947196712918154,{"$f":"Summary!$D$8*(Q12/Summary!$D$6)","v":2659107.9714352335},{"$f":"LIFT!$E$30-LIFT!$E$27+Interpolation2D(LIFT!$E$23,LOG10(R12),FIGURE!$AL$74:$AL$89,FIGURE!$AM$72:$AP$72,FIGURE!$AM$74:$AP$89)","v":1.6150562503728167},{"$f":"Interpolation2D(D12,$T$3,$D$5:$D$45,$E$3:$O$3,$E$5:$O$45)","v":1.5487883131980587},-6.6267937174758096E-2]
[null,9,{"$f":"-('Wing Geometry'!$D$4/2)*COS(PI()/(COUNT($B:$B)-1)*(B13-1))","v":-4.8541019662496847},{"$f":"C13/(Summary!$D$7/2)","v":-0.80901699437494745},0.55839137498463487,0.72631216320622316,0.89423295142781334,1.0621537396494025,1.2300745278709908,1.39799531609258,1.5659161043141705,1.7338368925357572,1.9017576807573457,2.0696784689789367,2.2375992572005252,null,1.3819660112501047,{"$f":"Summary!$D$8*(Q13/Summary!$D$6)","v":2838295.36095729},{"$f":"LIFT!$E$30-LIFT!$E$27+Interpolation2D(LIFT!$E$23,LOG10(R13),FIGURE!$AL$74:$AL$89,FIGURE!$AM$72:$AP$72,FIGURE!$AM$74:$AP$89)","v":1.6150562503728167},{"$f":"Interpolation2D(D13,$T$3,$D$5:$D$45,$E$3:$O$3,$E$5:$O$45)","v":1.5933257909646119},-2.1730459408204839E-2]
[null,10,{"$f":"-('Wing Geometry'!$D$4/2)*COS(PI()/(COUNT($B:$B)-1)*(B14-1))","v":-4.5624357936001854},{"$f":"C14/(Summary!$D$7/2)","v":-0.76040596560003093},0.57283599978902899,0.74221241287578199,0.91158882596253665,1.0809652390492903,1.2503416521360424,1.4197180652227968,1.5890944783095515,1.758470891396303,1.9278473044830571,2.0972237175698125,2.2666001306565646,null,1.4791880687999379,{"$f":"Summary!$D$8*(Q14/Summary!$D$6)","v":3037970.9772025831},{"$f":"LIFT!$E$30-LIFT!$E$27+Interpolation2D(LIFT!$E$23,LOG10(R14),FIGURE!$AL$74:$AL$89,FIGURE!$AM$72:$AP$72,FIGURE!$AM$74:$AP$89)","v":1.6167417664020616},{"$f":"Interpolation2D(D14,$T$3,$D$5:$D$45,$E$3:$O$3,$E$5:$O$45)","v":1.6167417664020616},0]
[null,11,{"$f":"-('Wing Geometry'!$D$4/2)*COS(PI()/(COUNT($B:$B)-1)*(B15-1))","v":-4.2426406871192857},{"$f":"C15/(Summary!$D$7/2)","v":-0.70710678118654757},0.58291302189368988,0.75190515984406714,0.92089729779444518,1.0898894357448226,1.2588815736951993,1.4278737116455773,1.5968658495959551,1.7658579875463321,1.9348501254967083,2.1038422634470879,2.2728344013974633,null,1.5857864376269046,{"$f":"Summary!$D$8*(Q15/Summary!$D$6)","v":3256903.7535980786},{"$f":"LIFT!$E$30-LIFT!$E$27+Interpolation2D(LIFT!$E$23,LOG10(R15),FIGURE!$AL$74:$AL$89,FIGURE!$AM$72:$AP$72,FIGURE!$AM$74:$AP$89)","v":1.6260671198886933},{"$f":"Interpolation2D(D15,$T$3,$D$5:$D$45,$E$3:$O$3,$E$5:$O$45)","v":1.6244504125119867},-1.6167073767066054E-3]
{"$rows_left_out":31}
{"sheet":"FIGURE","index":6,"n_rows":142,"n_cols":46,"rows_kept":142,"cut":false,"hidden":false,"merged":[]}
[]
[null,"FIGURE 2.2.1-8"]
[null,"t/c","Δy"]
[null,0,0]
[null,0.01,0.2632529320467204]
[null,0.02,0.5265058640934408]
[null,0.03,0.7897587961401612]
[null,0.04,1.0530117281868816]
[null,0.05,1.3162646602336021]
[null,0.06,1.5795175922803224]
[null,7.0000000000000007E-2,1.8427705243270431]
[null,0.08,2.1060234563737632]
[null,0.09,2.3692763884204835]
[null,0.1,2.5993282608003501]
[null,0.11,2.83240175188855]
{"$rows_left_out":127}